[Top][All Lists]

[Date Prev][Date Next][Thread Prev][Thread Next][Date Index][Thread Index]

bug#22020: guile-sdl-0.5.2 fails to install on i686

From: Luis Felipe López Acevedo
Subject: bug#22020: guile-sdl-0.5.2 fails to install on i686
Date: Thu, 26 Nov 2015 17:31:23 -0500


I'm using Guix 0.9.0 on Debian 8 (i686). Running the following command:

    $ guix package -i guile-sdl

Results in the following error:

--8<---------------cut here---------------start------------->8---
1 of 9 tests failed
(2 tests were not run)
Please report to address@hidden
Makefile:352: recipe for target 'check-TESTS' failed
make[2]: *** [check-TESTS] Error 1
make[2]: Leaving directory
Makefile:475: recipe for target 'check-am' failed
make[1]: *** [check-am] Error 2
make[1]: Leaving directory
Makefile:415: recipe for target 'check-recursive' failed
make: *** [check-recursive] Error 1
phase `check' failed after 24.3 seconds
builder for
`/gnu/store/zq1lxrsqsn3xkzcg0z4s88j5pgjndijm-guile-sdl-0.5.2.drv' failed
with exit code 1
cannot build derivation
`/gnu/store/0wlwdvdj7xba6kljfwxxsg4ch7ckdrgs-profile.drv': 1
dependencies couldn't be built
guix package: error: build failed: build of
`/gnu/store/0wlwdvdj7xba6kljfwxxsg4ch7ckdrgs-profile.drv' failed
--8<---------------cut here---------------end--------------->8---

Hydra also says the package is failing to build:



Luis Felipe López Acevedo

reply via email to

[Prev in Thread] Current Thread [Next in Thread]