[Top][All Lists]

[Date Prev][Date Next][Thread Prev][Thread Next][Date Index][Thread Index]

bug#30299: [core-updates] shepherd fails tests on all systems except x86

From: Mark H Weaver
Subject: bug#30299: [core-updates] shepherd fails tests on all systems except x86_64
Date: Thu, 15 Feb 2018 14:21:25 -0500
User-agent: Gnus/5.13 (Gnus v5.13) Emacs/25.3 (gnu/linux)

Hi Ludovic,

Mark H Weaver <address@hidden> writes:

> address@hidden (Ludovic Courtès) writes:
>> Mark H Weaver <address@hidden> skribis:
>>> On core-updates, Hydra has been unable to successfully build 'shepherd'
>>> on any system except x86_64-linux.  I can also report that on my
>>> mips64el-linux GuixSD system, which is running something close to
>>> 'core-updates', I had to disable tests on shepherd in order to build it.
>>> I don't know about aarch64-linux.
>>> These are the tests that commonly fail:
>>>   FAIL: tests/respawn.sh
>>>   FAIL: tests/respawn-throttling.sh
>>>   FAIL: tests/basic.sh
>> This is a non-deterministic failure.  I could reproduce the
>> tests/basic.sh one and it is fixed by this:
>> https://git.savannah.gnu.org/cgit/shepherd.git/commit/?id=cc9564586729a5bb90dd5d2722b543fdde9ab821
> For now, I added your patch to the shepherd package in core-updates, in
> commit f2d2ee42f168909f27c0c3b6532ef16febfd3b86.

With your patch, Hydra built shepherd successfully on i686-linux on the
first try, which is much better than the 19th try :)

However, on armhf-linux, three tests failed: respawn.sh,
respawn-throttling.sh, and pid-file.sh.


We should probably arrange for test-suite.log to be printed when "make
check" fails.  We could add this functionality to selected packages like
shepherd and guix the next time we update them, and maybe consider
adding something generic to gnu-build-system's check phase in the next
core-updates cycle.  What do you think?


--8<---------------cut here---------------start------------->8---
starting phase `check'
make  check-am
make[1]: Entering directory 
make  check-TESTS
make[2]: Entering directory 
make[3]: Entering directory 
PASS: tests/misbehaved-client.sh
FAIL: tests/respawn.sh
PASS: tests/no-home.sh
FAIL: tests/pid-file.sh
PASS: tests/status-sexp.sh
PASS: tests/sigint.sh
PASS: tests/basic.sh
FAIL: tests/respawn-throttling.sh
Testsuite summary for GNU Shepherd 0.3.2
# TOTAL: 8
# PASS:  5
# SKIP:  0
# XFAIL: 0
# FAIL:  3
# XPASS: 0
# ERROR: 0
See ./test-suite.log
Please report to address@hidden
make[3]: *** [Makefile:1220: test-suite.log] Error 1
make[3]: Leaving directory '/tmp/guix-build-shepherd-0.3.2.drv-0/shepherd-0.3.2'
make[2]: *** [Makefile:1328: check-TESTS] Error 2
make[2]: Leaving directory '/tmp/guix-build-shepherd-0.3.2.drv-0/shepherd-0.3.2'
make[1]: *** [Makefile:1527: check-am] Error 2
make[1]: Leaving directory '/tmp/guix-build-shepherd-0.3.2.drv-0/shepherd-0.3.2'
make: *** [Makefile:1529: check] Error 2
phase `check' failed after 29.6 seconds
builder for `/gnu/store/sk0l3ll4x1ddn9zwxmfqjipr578hiqx1-shepherd-0.3.2.drv' 
failed with exit code 1
@ build-failed /gnu/store/sk0l3ll4x1ddn9zwxmfqjipr578hiqx1-shepherd-0.3.2.drv - 
1 builder for `/gnu/store/sk0l3ll4x1ddn9zwxmfqjipr578hiqx1-shepherd-0.3.2.drv' 
failed with exit code 1
--8<---------------cut here---------------end--------------->8---

reply via email to

[Prev in Thread] Current Thread [Next in Thread]