[Top][All Lists]

[Date Prev][Date Next][Thread Prev][Thread Next][Date Index][Thread Index]

bug#36686: evolution-data-server fails on core-updates (10 dependents)

From: Chris Marusich
Subject: bug#36686: evolution-data-server fails on core-updates (10 dependents)
Date: Tue, 16 Jul 2019 00:16:17 -0700
User-agent: Gnus/5.13 (Gnus v5.13) Emacs/26.1 (gnu/linux)


On commit 464a29d3d74e7d2f27042db6ab166bfdbe1f992e ('git branch --all
--contains 464a29d3d74e7d2f27042db6ab166bfdbe1f992e' reports this commit
is only merged into core-updates at this time), evolution-data-server
fails with the following error, which causes its 10 dependent packages
to fail, also:

--8<---------------cut here---------------start------------->8---
$ guix build evolution-data-server


95% tests passed, 5 tests failed out of 101

Total Test time (real) =  62.06 sec

The following tests FAILED:
         70 - test-cal-client-get-revision (Child aborted)
         74 - test-book-cache-cursor-move-by-posix (SIGTRAP)
         81 - test-book-cache-cursor-change-locale (SIGTRAP)
         86 - test-sqlite-cursor-move-by-posix (SIGTRAP)
         93 - test-sqlite-cursor-change-locale (SIGTRAP)
Errors while running CTest
make: *** [Makefile:122: test] Error 8

Test suite failed, dumping logs.
command "make" "test" failed with status 2
builder for 
failed with exit code 1
build of 
View build log at 
guix build: error: build of 
--8<---------------cut here---------------end--------------->8---


Attachment: signature.asc
Description: PGP signature

reply via email to

[Prev in Thread] Current Thread [Next in Thread]