[Top][All Lists]

[Date Prev][Date Next][Thread Prev][Thread Next][Date Index][Thread Index]

bug#39834: make check fails

From: Damien Cassou
Subject: bug#39834: make check fails
Date: Sat, 29 Feb 2020 15:59:38 +0100

OS: Fedora 31

$ guix describe
Generation 13   Feb 29 2020 15:00:51    (current)
  guix f76c16d
    repository URL: file:///home/cassou/Documents/projects/guix/guix
    branch: master
    commit: f76c16d220e6c349441c08bf25a5197037490fa5

$ cd /home/cassou/Documents/projects/guix/guix

$ guix environment --pure guix -- ./bootstrap

$ guix environment --pure guix -- ./configure --localstatedir=/var

$ guix environment --pure guix -- make check -j4
FAIL: tests/lint.scm
FAIL: tests/pack.scm
make[4]: *** [Makefile:5100: tests/store.log] Error 1
make[4]: *** Waiting for unfinished jobs....
make[4]: Leaving directory '/home/cassou/Documents/projects/guix/guix'
make[3]: *** [Makefile:5082: check-TESTS] Error 2
make[3]: Leaving directory '/home/cassou/Documents/projects/guix/guix'
make[2]: *** [Makefile:5325: check-am] Error 2
make[2]: Leaving directory '/home/cassou/Documents/projects/guix/guix'
make[1]: *** [Makefile:4859: check-recursive] Error 1
make[1]: Leaving directory '/home/cassou/Documents/projects/guix/guix'
make: *** [Makefile:5327: check] Error 2

Damien Cassou

"Success is the ability to go from one failure to another without
losing enthusiasm." --Winston Churchill

Attachment: make-check.log
Description: Text document

Attachment: pack.log
Description: Text document

Attachment: lint.log
Description: Text document

reply via email to

[Prev in Thread] Current Thread [Next in Thread]