[Top][All Lists]

[Date Prev][Date Next][Thread Prev][Thread Next][Date Index][Thread Index]

[GNU tar 1.32] testsuite: 172 173 174 failed

From: Kenneth Martin
Subject: [GNU tar 1.32] testsuite: 172 173 174 failed
Date: Sun, 24 Nov 2019 20:09:48 -0500

ERROR: 197 tests were run,
3 failed unexpectedly.
37 tests were skipped.
## -------------------------- ##
## testsuite.log was created. ##
## -------------------------- ##

Please send `tests/testsuite.log' and all information you think might help:

   To: <address@hidden>
   Subject: [GNU tar 1.32] testsuite: 172 173 174 failed

You may investigate any problem if you feel able to do so, in which
case the test suite provides a good starting point.  Its output may
be found below `tests/testsuite.dir'.

Makefile:1838: recipe for target 'check-local' failed
make[2]: *** [check-local] Error 1
make[2]: Leaving directory '/home/ken/tar-1.32/tests'
Makefile:1689: recipe for target 'check-am' failed
make[1]: *** [check-am] Error 2
make[1]: Leaving directory '/home/ken/tar-1.32/tests'
Makefile:1410: recipe for target 'check-recursive' failed
make: *** [check-recursive] Error 1

172: sparse file truncated while archiving           FAILED (sptrcreat.at:36)
173: file truncated in sparse region while comparing FAILED (sptrdiff00.at:30)
174: file truncated in data region while comparing   FAILED (sptrdiff01.at:30)

Resulting tar was not created.
gcc (Ubuntu 7.4.0-1ubuntu1~18.04.1) 7.4.0
GNU Make 4.1 Built for x86_64-pc-linux-gnu

testsuite.log attached.


Attachment: testsuite.log
Description: Binary data

reply via email to

[Prev in Thread] Current Thread [Next in Thread]