[Top][All Lists]

[Date Prev][Date Next][Thread Prev][Thread Next][Date Index][Thread Index]

Re: [Ccrtp-devel] ccrtp-1.5.0 and Solaris 10 x86 errors

From: Aaron Wilson
Subject: Re: [Ccrtp-devel] ccrtp-1.5.0 and Solaris 10 x86 errors
Date: Wed, 15 Nov 2006 13:58:36 -0800
User-agent: Thunderbird (X11/20060915)

I'm getting this error when trying to make ccrtp 1.5.0 on Solaris 10 on Opteron processor

incqueue.cpp:692: error: `timersub' was not declared in this scope
incqueue.cpp:692: warning: unused variable 'timersub'
gmake[3]: *** [incqueue.lo] Error 1
gmake[3]: Leaving directory `/usr/share/src/ccrtp-1.5.0/src'
gmake[2]: *** [all-recursive] Error 1
gmake[2]: Leaving directory `/usr/share/src/ccrtp-1.5.0/src'
gmake[1]: *** [all] Error 2
gmake[1]: Leaving directory `/usr/share/src/ccrtp-1.5.0/src'
gmake: *** [all-recursive] Error 1

Can anyone help me with this?



reply via email to

[Prev in Thread] Current Thread [Next in Thread]