[Top][All Lists]

[Date Prev][Date Next][Thread Prev][Thread Next][Date Index][Thread Index]

[certi-dev] Building CERTI on Ubuntu 15.10 (64bit)

From: Åsmund Hjulstad
Subject: [certi-dev] Building CERTI on Ubuntu 15.10 (64bit)
Date: Tue, 13 Oct 2015 12:53:29 +0200


On a clean virtual machine with the latest Ubuntu 15.10 beta I try to compile CERTI from git.

When trying to link libFedTimed, I get (last part of make output):

Scanning dependencies of target FedTime
[ 64%] Building CXX object libRTI/hla-1_3/CMakeFiles/FedTime.dir/RTIfedTime.cc.o
/home/ahju/hla/certi/libRTI/hla-1_3/RTIfedTime.cc: In static member function ‘static RTI::FedTime* RTI::FedTimeFactory::makeZero()’:
/home/ahju/hla/certi/libRTI/hla-1_3/RTIfedTime.cc:75:1: warning: control reaches end of non-void function [-Wreturn-type]
/home/ahju/hla/certi/libRTI/hla-1_3/RTIfedTime.cc: In static member function ‘static RTI::FedTime* RTI::FedTimeFactory::decode(const char*)’:
/home/ahju/hla/certi/libRTI/hla-1_3/RTIfedTime.cc:92:1: warning: control reaches end of non-void function [-Wreturn-type]
/home/ahju/hla/certi/libRTI/hla-1_3/RTIfedTime.cc: In function ‘const RTIfedTime& {anonymous}::rft(const RTI::FedTime&)’:
/home/ahju/hla/certi/libRTI/hla-1_3/RTIfedTime.cc:51:1: warning: control reaches end of non-void function [-Wreturn-type]
Linking CXX shared library libFedTimed.so
[ 64%] Built target FedTime
Scanning dependencies of target RTI
[ 65%] Building CXX object libRTI/hla-1_3/CMakeFiles/RTI.dir/RTIambassador.cc.o
[ 65%] Building CXX object libRTI/hla-1_3/CMakeFiles/RTI.dir/RTIambPrivateRefs.cc.o
[ 66%] Building CXX object libRTI/hla-1_3/CMakeFiles/RTI.dir/RTItypes.cc.o
[ 67%] Building CXX object libRTI/hla-1_3/CMakeFiles/RTI.dir/RTItypesImp.cc.o
Linking CXX shared library libRTI-NGd.so
[ 67%] Built target RTI
Scanning dependencies of target TestFedTime
[ 67%] Building CXX object libRTI/hla-1_3/CMakeFiles/TestFedTime.dir/TestFedTime.cc.o
Linking CXX executable TestFedTime
libFedTimed.so.1.0.0: undefined reference to `typeinfo for RTI::Exception'
collect2: error: ld returned 1 exit status
libRTI/hla-1_3/CMakeFiles/TestFedTime.dir/build.make:90: recipe for target 'libRTI/hla-1_3/TestFedTime' failed
make[2]: *** [libRTI/hla-1_3/TestFedTime] Error 1
CMakeFiles/Makefile2:1583: recipe for target 'libRTI/hla-1_3/CMakeFiles/TestFedTime.dir/all' failed
make[1]: *** [libRTI/hla-1_3/CMakeFiles/TestFedTime.dir/all] Error 2
Makefile:146: recipe for target 'all' failed
make: *** [all] Error 2


Kind regards,
Åsmund Hjulstad

reply via email to

[Prev in Thread] Current Thread [Next in Thread]