[Top][All Lists]

[Date Prev][Date Next][Thread Prev][Thread Next][Date Index][Thread Index]

[Discuss-gnuradio] make check error

From: kelvin loi
Subject: [Discuss-gnuradio] make check error
Date: Tue, 3 Jan 2006 05:41:34 +0000 (GMT)

Hi All,
I was trying to write my own signal processing block,
howto.add_ff(), which  adds 1 to the signal. I have
followed every steps written in dawei shen's tutorial.
But i got make check error as following:
ERROR: test_003_add_ff (__main__.qa_howto)
Traceback (most recent call last):
  File "./qa_howto.py", line 62, in test_003_add_ff
    add=howto.add_ff ()
AttributeError: 'module' object has no attribute

Ran 3 tests in 0.008s

FAILED (errors=1)
FAIL: run_tests
1 of 1 tests failed
make[3]: *** [check-TESTS] Error 1
make[3]: Leaving directory
make[2]: *** [check-am] Error 2
make[2]: Leaving directory
make[1]: *** [check-recursive] Error 1
make[1]: Leaving directory
make: *** [check-recursive] Error 1

Is there anybody could help me out? Thanks


Send instant messages to your online friends http://uk.messenger.yahoo.com 

reply via email to

[Prev in Thread] Current Thread [Next in Thread]