[Top][All Lists]

[Date Prev][Date Next][Thread Prev][Thread Next][Date Index][Thread Index]

[Discuss-gnuradio] gnuradio build on Lion OSX 10.7.3 64-bit fails

From: Mikko Lähteenmäki
Subject: [Discuss-gnuradio] gnuradio build on Lion OSX 10.7.3 64-bit fails
Date: Sat, 31 Mar 2012 16:36:55 +0300

Hello, I have following environment:

Newest Xcode + homebrew port for other needed software/libs.
gr is installed via SVN.

When running make I get this problem which I cant pass:

Making all in hid
Makefile:935: *** extraneous `else'.  Stop.
make[5]: *** [all-recursive] Error 1
make[4]: *** [all] Error 2
make[3]: *** [all-recursive] Error 1
make[2]: *** [all] Error 2
make[1]: *** [all-recursive] Error 1
make: *** [all] Error 2

and make check produces this error message:

dyld: Symbol not found: _volk_machine_sse2_32
  Referenced from: /Users/ifreq/gnuradio/volk/lib/.libs/libvolk.0.dylib
  Expected in: flat namespace
 in /Users/ifreq/gnuradio/volk/lib/.libs/libvolk.0.dylib
/bin/sh: line 1: 65660 Trace/BPT trap: 5       ${dir}$tst

Waiting for possible fix, thanks in advance! :-)


Mikko, OH2FXD

reply via email to

[Prev in Thread] Current Thread [Next in Thread]