[Top][All Lists]

[Date Prev][Date Next][Thread Prev][Thread Next][Date Index][Thread Index]

Re: [Discuss-gnuradio] Still problems building gr 3.4.2 / Debian

From: Ralph A. Schmid, dk5ras
Subject: Re: [Discuss-gnuradio] Still problems building gr 3.4.2 / Debian
Date: Fri, 2 Aug 2013 22:19:14 +0200

OK, pulled fresh copy frokm git, no errors with bootstrap, but still this

/usr/bin/ld: usrp_rx_cfile.o: undefined reference to symbol
/usr/bin/ld: note: '_ZN5boost6system15system_categoryEv' is defined in DSO
/usr/lib/libboost_system.so.1.53.0 so try adding it to the linker command
/usr/lib/libboost_system.so.1.53.0: could not read symbols: Invalid
collect2: error: ld returned 1 exit status
make[5]: *** [usrp_rx_cfile] Error 1
make[5]: Leaving directory `/home/ras/gnuradio-3.4.2/gr-usrp/apps'
make[4]: *** [all] Error 2
make[4]: Leaving directory `/home/ras/gnuradio-3.4.2/gr-usrp/apps'
make[3]: *** [all-recursive] Error 1
make[3]: Leaving directory `/home/ras/gnuradio-3.4.2/gr-usrp'
make[2]: *** [all] Error 2
make[2]: Leaving directory `/home/ras/gnuradio-3.4.2/gr-usrp'
make[1]: *** [all-recursive] Error 1
make[1]: Leaving directory `/home/ras/gnuradio-3.4.2'
make: *** [all] Error 2

Now I will go to bed, maybe new day, new luck :)

Thanks a lot for your patience!!


reply via email to

[Prev in Thread] Current Thread [Next in Thread]