discuss-gnustep
[Top][All Lists]
Advanced

[Date Prev][Date Next][Thread Prev][Thread Next][Date Index][Thread Index]

Re: Bug in 'make install'


From: Nicola Pero
Subject: Re: Bug in 'make install'
Date: Sat, 13 Jan 2001 17:51:21 +0000 (GMT)

>>>>> "Philippe" == Philippe C D Robert <address@hidden> writes:

    Philippe> Hi, in the latest CVS code, you cannot do a 'make
    Philippe> install' anymore:

    Philippe> make[2]:
    Philippe> /usr/GNUstep/System/Makefiles/install-complete-dir.sh:
    Philippe> Command not found make[2]: *** [internal-app-install]
    Philippe> Error 127 make[1]: *** [ProjectCenter.build] Error 2
    Philippe> make: *** [ProjectCenter.install.app.variables] Error 2

You need to rerun ./configure and reinstall from scratch.



reply via email to

[Prev in Thread] Current Thread [Next in Thread]