[Date Prev][Date Next][Thread Prev][Thread Next][Date Index][Thread Index]
gcc 3.0 or bug ?
From: |
Dennis Leeuw |
Subject: |
gcc 3.0 or bug ? |
Date: |
Fri, 04 May 2001 09:13:35 +0200 |
Hi all,
While testing gcc 3.0 I took a CVS snapshot yesterday.
I build gcc 3.0 with objc, then build libxml and make, gnustep-objc,
make, ffcall, and now base, which gives an error.
I didn't build gmp, and ssl, so these are not available.
Now the question is is this error related to gcc 3.0 or is it a bug in
the CVS snapshot I have ?
Could someone explain to me how to solve this puzzle ?
behavior.m: In function `behavior_class_add_class':
behavior.m:112: structure has no member named `methodLists'
behavior.m:121: structure has no member named `methodLists'
behavior.m: In function `behavior_class_add_methods':
behavior.m:160: structure has no member named `obsolete'
behavior.m:173: structure has no member named `obsolete'
behavior.m:183: structure has no member named `methodLists'
behavior.m:200: structure has no member named `obsolete'
behavior.m:200: structure has no member named `methodLists'
behavior.m:201: structure has no member named `methodLists'
behavior.m: In function `search_for_method_in_list':
behavior.m:240: structure has no member named `obsolete'
make[3]: *** [shared_obj/ix86/linux-gnu/gnu-gnu-gnu/behavior.o] Error 1
make[2]: *** [libgnustep-base.build] Error 2
make[1]: *** [libgnustep-base.all.library.variables] Error 2
make[1]: Leaving directory `/opt/src/core/base/Source'
make: *** [internal-all] Error 2
Greetings,
Dennis Leeuw
dleeuw.vcf
Description: Card for Dennis Leeuw
- gcc 3.0 or bug ?,
Dennis Leeuw <=