[Top][All Lists]

[Date Prev][Date Next][Thread Prev][Thread Next][Date Index][Thread Index]

StepTalk build error

From: Dennis Leeuw
Subject: StepTalk build error
Date: Sun, 15 Sep 2002 10:52:00 +0200

Hi all,

I am working on an update of the GNUstep Build Guide and ran into the
following error when building StepTalk.
I am using gcc 3.2 and GNUstep CVS from 2002 sept 14 (my own checkout).

 Compiling file STAppKitModule.m ...
STAppKitModule.m: In function `+[STAppKitModule initialize]':
STAppKitModule.m:42: warning: cannot find method
STAppKitModule.m:42: warning: return type for `sharedApplication'
defaults to id
 Compiling file AppKitConstants.m ...
AppKitConstants.m: In function `STGetAppKitConstants':
AppKitConstants.m:336: `GSFileWrapperDirectoryType' undeclared (first
use in this function)
AppKitConstants.m:336: (Each undeclared identifier is reported only once

AppKitConstants.m:336: for each function it appears in.)
AppKitConstants.m:337: `GSFileWrapperRegularFileType' undeclared (first
use in this function)
AppKitConstants.m:338: `GSFileWrapperSymbolicLinkType' undeclared (first
use in this function)
make[3]: *** [shared_obj/ix86/linux-gnu/gnu-gnu-gnu/AppKitConstants.o]
Error 1
make[2]: *** [AppKit.all.bundle.variables] Error 2
make[2]: Leaving directory
make[1]: *** [internal-all] Error 2
make[1]: Leaving directory
make: *** [internal-all] Error 2

Is this a known problem ?


Dennis Leeuw

reply via email to

[Prev in Thread] Current Thread [Next in Thread]