discuss-gnustep
[Top][All Lists]
Advanced

[Date Prev][Date Next][Thread Prev][Thread Next][Date Index][Thread Index]

Problems installing gnustep-base


From: Radhika Uchil
Subject: Problems installing gnustep-base
Date: Tue, 24 Sep 2002 17:20:17 +0530

Hi

I get the following error on trying to do a make of gnustep-base-1.4.1

Compiling file NSFileManager.m ...
NSFileManager.m: In function `-[NSFileManager isWritableFileAtPath:]':
NSFileManager.m:958: `isExecutableFileAtPath' undeclared (first use in this
func
tion)
NSFileManager.m:958: (Each undeclared identifier is reported only once
NSFileManager.m:958: for each function it appears in.)
NSFileManager.m:958: parse error before ':' token
NSFileManager.m: At top level:
NSFileManager.m:1559: warning: incomplete implementation of class
`NSFileManager
'
NSFileManager.m:1559: warning: method definition for
`-isExecutableFileAtPath:'
not found
NSFileManager.m: In function `-[NSFileManager(PrivateMethods)
_attributesAtPath:
traverseLink:forCopy:]':
NSFileManager.m:2463: warning: unused variable `u'
make[2]: *** [shared_obj/ix86/mingw32/gnu-gnu-gnu/NSFileManager.o] Error 1
make[1]: *** [libgnustep-base.all.library.variables] Error 2
make[1]: Leaving directory `/e/gnustep-base-1.4.1/Source'
make: *** [internal-all] Error 2


Additional Info'

I am using gcc 3.2, gnumake 4.0, ffcall 1.8d and libobjc 1.2.2 on WinNT 4.0

I get the same error even if I omit the installation of libobjc.

What could possibly be wrong. Pls. help.

Rgds
Radhika
Radhika Uchil
Senior Consultant                 
Phone: +91-80-5583025  Extn : 8612  Fax : +91-80-5581425
Email : address@hidden   
----------------------------------------------------
Symphony Services     
www.symphserv.com      





reply via email to

[Prev in Thread] Current Thread [Next in Thread]