[Top][All Lists]

[Date Prev][Date Next][Thread Prev][Thread Next][Date Index][Thread Index]

Re: Error while compiling on windows

From: Fred Kiefer
Subject: Re: Error while compiling on windows
Date: Wed, 01 Feb 2012 19:40:00 +0100
User-agent: Mozilla/5.0 (X11; Linux x86_64; rv:9.0) Gecko/20111220 Thunderbird/9.0

On 01.02.2012 16:04, riccardo.mottola@libero.it wrote:

while compiling (on windows), I get:

  Compiling file GSThemeInspector.m ...
GSThemeInspector.m: In function `-[GSThemeInspector update:]':
GSThemeInspector.m:181: warning: `NSClipView' may not respond to `-bounds'
GSThemeInspector.m:181: warning: (Messages without a matching method
GSThemeInspector.m:181: warning: will be assumed to return `id' and accept
GSThemeInspector.m:181: warning: `...' as arguments.)
GSThemeInspector.m:181: error: incompatible types in assignment
make[4]: *** [obj/libgnustep-gui.obj/GSThemeInspector.m.o] Error 1
make[3]: *** [internal-library-all_] Error 2


Thank you for spotting this. The change I made yesterday requires an additional #import, which I have now added. Please test again.


reply via email to

[Prev in Thread] Current Thread [Next in Thread]