[Top][All Lists]

[Date Prev][Date Next][Thread Prev][Thread Next][Date Index][Thread Index]

[debbugs-tracker] bug#2720: closed (crash)

From: GNU bug Tracking System
Subject: [debbugs-tracker] bug#2720: closed (crash)
Date: Sun, 17 Feb 2013 03:05:02 +0000

Your message dated Sat, 16 Feb 2013 22:03:09 -0500
with message-id <address@hidden>
and subject line Re: bug#2720: error in build cvs version on Mac OS X
has caused the debbugs.gnu.org bug report #2720,
regarding crash
to be marked as done.

(If you believe you have received this mail in error, please contact

2720: http://debbugs.gnu.org/cgi/bugreport.cgi?bug=2720
GNU Bug Tracking System
Contact address@hidden with problems
--- Begin Message --- Subject: error in build cvs version on Mac OS X Date: Thu, 19 Mar 2009 07:06:07 -0700
Hi all,

It's now actually been a couple of *years* that I've been unsuccessful in building Emacs from cvs source on Mac OS X: first on my Powerpc Powerbook G4, and now on my Intel Mac. The build process always balks at the bootstrap stage with the following message:
Loading loadup.el (source)...
Using load-path (/home/ritesh/pkg/emacs/lisp /home/ritesh/pkg/emacs/ lisp/emacs-lisp \ /home/ritesh/pkg/emacs/lisp/language /home/ritesh/pkg/emacs/lisp/ international \
Loading emacs-lisp/byte-run (compiled; note, source file is newer)...
Invalid coding system: emacs-mule
make[1]: *** [bootstrap-emacs] Error 255
make: *** [src] Error 2
My build environment is quite pristine, no libraries from fink, etc., interfering with those installed by Xcode.
Here's how I run configure
CFLAGS="$CFLAGS -Wno-pointer-sign"
./configure                             \
--enable-locallisppath=$HOME/elisp      \
--without-pop                           \
--without-kerberos                      \
--without-kerberos5                     \
--without-sound                         \
--without-x                             \
-without-toolkit-scroll-bars            \
--without-dbus                          \
--without-gpm                           \
--with-ns                               \
Although I don't understand the last option, the build fails with or without it. It might not be a bug after all, but I have seen update after update to the cvs repository but the build failure refuses to go away. It's in sheer frustration that I'm resorting to sending a mail to the bugs list. Hopefully someone can figure out the problem, or has seen this issue elsewhere.
Help much appreciated,

--- End Message ---
--- Begin Message --- Subject: Re: bug#2720: error in build cvs version on Mac OS X Date: Sat, 16 Feb 2013 22:03:09 -0500 User-agent: Gnus (www.gnus.org), GNU Emacs (www.gnu.org/software/emacs/)
Sorry no-one ever investigated your crash. After so much time, I don't
think we can do anything without a recipe to produce this issue. If it
happens again with the current version of Emacs (currently 24.2), please
make a new report and hopefully we do better next time.

--- End Message ---

reply via email to

[Prev in Thread] Current Thread [Next in Thread]