[Top][All Lists]

[Date Prev][Date Next][Thread Prev][Thread Next][Date Index][Thread Index]

[Emacs-buildstatus] emacs | Pipeline #8319574 has failed for scratch/tzz

From: GitLab
Subject: [Emacs-buildstatus] emacs | Pipeline #8319574 has failed for scratch/tzz/nettle | 518937f9
Date: Tue, 16 May 2017 22:35:08 +0000

✖ Your pipeline has failed.
Project emacs-ci / emacs
Branch icon scratch/tzz/nettle
Commit icon 518937f9
GnuTLS HMAC and symmetric cipher support with t...
Commit Author
Avatar Ted Zlatanov
Pipeline #8319574 triggered by Avatar Ted Zlatanov
had 1 failed build.
Logs may contain sensitive data. Please consider before forwarding this email.
✖ test
Makefile:207: recipe for target 'check-doit' failed
make[2]: *** [check-doit] Error 2
make[2]: Leaving directory '/builds/emacs-ci/emacs/test'
Makefile:190: recipe for target 'check' failed
make[1]: *** [check] Error 2
make[1]: Leaving directory '/builds/emacs-ci/emacs/test'
make: *** [check] Error 2
Makefile:942: recipe for target 'check' failed
ERROR: Job failed: exit code 1

reply via email to

[Prev in Thread] Current Thread [Next in Thread]