[Top][All Lists]

[Date Prev][Date Next][Thread Prev][Thread Next][Date Index][Thread Index]

RE: clean bootstrap build error with latest CVS (updated today)

From: Fred Kunz
Subject: RE: clean bootstrap build error with latest CVS (updated today)
Date: Fri, 7 Jan 2005 13:37:58 -0800

This was built in the NT directory on a windows platform.


From: Fred Kunz
Sent: Friday, January 07, 2005 1:07 PM
To: 'address@hidden'
Cc: address@hidden
Subject: clean bootstrap build error with latest CVS (updated today)


gcc -o oo-spd/i386/temacs.bin  -g   -Wl,-stack,0x00800000 -Wl,-heap,0x00100000 -

Wl,-image-base,0x01000000 -g -Wl,-subsystem,console -Wl,-entry,__start -Wl,-Map,

oo-spd/i386/temacs.map oo-spd/i386/firstfile.o oo-spd/i386/emacs.res oo-spd/i386

/temacs0.a oo-spd/i386/temacs1.a oo-spd/i386/temacw32.a oo-spd/i386/lastfile.a -

lwinmm -ladvapi32 -lgdi32 -lcomdlg32 -luser32 -lmpr -lshell32 -lwinspool

oo-spd/i386/temacs1.a(fileio.o)(.text+0x2ece): In function `Fmake_symbolic_link'


C:/CVSSrc/emacs/src/fileio.c:2872: undefined reference to `symlink'


 undefined reference to `symlink'

oo-spd/i386/temacs1.a(fileio.o)(.text+0x370f): In function `Ffile_symlink_p':

C:/CVSSrc/emacs/src/fileio.c:3246: undefined reference to `readlink'

collect2: ld returned 1 exit status

gmake[2]: *** [oo-spd/i386/temacs.exe] Error 1

gmake[2]: Leaving directory `C:/CVSSrc/emacs/src'

gmake[1]: *** [bootstrap-temacs] Error 2

gmake[1]: Leaving directory `C:/CVSSrc/emacs/src'

gmake: *** [bootstrap-gmake] Error 2


Fred Kunz

Software Architect

Professional Engineering Services

BSQUARE Corporation

(425) 519-5900



reply via email to

[Prev in Thread] Current Thread [Next in Thread]