[Top][All Lists]

[Date Prev][Date Next][Thread Prev][Thread Next][Date Index][Thread Index]

compilation error on w32 (GCC)

From: Dhruva Krishnamurthy
Subject: compilation error on w32 (GCC)
Date: Tue, 7 Feb 2006 09:53:31 +0530

 While compiling CVS Emacs on W32 using GCC, I get the following error.

term.c: In function `produce_glyphs':
term.c:1756: error: `unibyte_display_via_language_environment'
undeclared (first use in this function)
term.c:1756: error: (Each undeclared identifier is reported only once
term.c:1756: error: for each function it appears in.)
make[2]: *** [oo-spd/i386/term.o] Error 1
make[2]: Leaving directory `C:/tmp/build/emacs/src'
make[1]: *** [bootstrap-temacs] Error 2
make[1]: Leaving directory `C:/tmp/build/emacs/src'
make: *** [bootstrap-gmake] Error 2

with best regards,

Dhruva Krishnamurthy
GNU/FSF member: 1935

reply via email to

[Prev in Thread] Current Thread [Next in Thread]