[Top][All Lists]

[Date Prev][Date Next][Thread Prev][Thread Next][Date Index][Thread Index]

Re: Build failure under Suse 10.0

From: Chong Yidong
Subject: Re: Build failure under Suse 10.0
Date: Mon, 30 Oct 2006 18:16:01 -0500
User-agent: Gnus/5.11 (Gnus v5.11) Emacs/22.0.90 (gnu/linux)

Frank Schmitt <address@hidden> writes:

> Hello
> I get a build failure with current CVS-Head:
>   -I/export/inverness/cvs/emacs/src -D_BSD_SOURCE -I/usr/X11R6/include
>   -I/usr/
> include/alsa -g -O2 -Wno-pointer-sign  image.c
> image.c: In function ‘gif_load’:
> image.c:7874: error: ‘struct <anonymous>’ has no member named ‘Function’
> make[2]: *** [image.o] Error 1
> make[2]: Leaving directory `/export/inverness/cvs/emacs/src'
> make[1]: *** [bootstrap-build] Error 2
> make[1]: Leaving directory `/export/inverness/cvs/emacs'
> make: *** [bootstrap] Error 2
> [inverness:~d/cvs/emacs]$ rpm -q giflib giflib-devel
> giflib-4.1.3-7.2
> giflib-devel-4.1.3-7.2
> I don't have any strange gif_lib.h files lying around and the
> relevant lines in /usr/include/gif_lib.h look ok to me

What configure options did you use?  Does an ordinary ./configure &&
make work?

reply via email to

[Prev in Thread] Current Thread [Next in Thread]