[Top][All Lists]

[Date Prev][Date Next][Thread Prev][Thread Next][Date Index][Thread Index]

buildproblem with gpm installed

From: Han Boetes
Subject: buildproblem with gpm installed
Date: Sun, 3 Jun 2007 18:30:06 +0200
User-agent: Mutt/1.5.15 (2007-04-06)

Hi, I have gpm installed and since the latest commit to src/term.c
I get:

gcc -c -D_BSD_SOURCE  -g -Demacs -DHAVE_CONFIG_H -DUSE_GTK  -I. 
-I/mnt/nfs/Emacs/emacs/src -D_BSD_SOURCE -I/usr/include/gtk-2.0 
-I/usr/lib/gtk-2.0/include -I/usr/include/atk-1.0 -I/usr/include/cairo 
-I/usr/include/pango-1.0 -I/usr/include/glib-2.0 -I/usr/lib/glib-2.0/include 
-I/usr/include/freetype2 -I/usr/include/libpng12 -I/usr/include/freetype2 
-I/usr/include/alsa -O2 -pipe -DHAVE_GTK_MULTIDISPLAY 
/mnt/nfs/Emacs/emacs/src/term.c: In function `init_tty':
/mnt/nfs/Emacs/emacs/src/term.c:3272: error: `mouse_position_hook' undeclared 
(first use in this function)
/mnt/nfs/Emacs/emacs/src/term.c:3272: error: (Each undeclared identifier is 
reported only once
/mnt/nfs/Emacs/emacs/src/term.c:3272: error: for each function it appears in.)
make[2]: *** [term.o] Error 1

This is on a */linux machine.

# Han
   \___/  ,_,
   |o,o| (O,O)                         Does the name Pavlov ring a bell?
 \/    ) (   )

reply via email to

[Prev in Thread] Current Thread [Next in Thread]