[Top][All Lists]

[Date Prev][Date Next][Thread Prev][Thread Next][Date Index][Thread Index]

Re: Emacs CVS build failure

From: Stefan Monnier
Subject: Re: Emacs CVS build failure
Date: Sat, 14 Jun 2008 12:36:37 -0400
User-agent: Gnus/5.13 (Gnus v5.13) Emacs/23.0.60 (gnu/linux)

> I just updated my Emacs CVS working copy and get the following error when
> running `make':

> character.c: In function ‘Fmultibyte_char_to_unibyte’:
> character.c:362: error: too many arguments to function 
> ‘multibyte_char_to_unibyte_safe’
> make[1]: *** [character.o] Error 1
> make[1]: Leaving directory `/home/michael/src/nonlocal/emacs/emacs-cvs/src'
> make: *** [src] Error 2

Thank you, this has been fixed since,


reply via email to

[Prev in Thread] Current Thread [Next in Thread]