[Top][All Lists]

[Date Prev][Date Next][Thread Prev][Thread Next][Date Index][Thread Index]

trunk fails to build

From: Fabian Ezequiel Gallina
Subject: trunk fails to build
Date: Sat, 7 May 2011 23:37:20 -0300

Hi all,

While trying to compile from trunk (revno: 104157)  I'm getting this error:

Compiling cedet/cedet-idutils.el
Wrote /home/fgallina/Projects/trunk/lisp/cedet/cedet-idutils.elc
Compiling cedet/data-debug.el
Wrote /home/fgallina/Projects/trunk/lisp/cedet/data-debug.elc
Compiling cedet/ede.el

In toplevel form:
cedet/ede.el:44:1:Error: Symbol's value as variable is void: &rest
make[3]: *** [cedet/ede.elc] Error 1
make[3]: Leaving directory `/home/fgallina/Projects/trunk/lisp'
make[2]: *** [compile-main] Error 2
make[2]: Leaving directory `/home/fgallina/Projects/trunk/lisp'
make[1]: *** [lisp] Error 2
make[1]: Leaving directory `/home/fgallina/Projects/trunk'
make: *** [bootstrap] Error 2

Any ideas?

Fabián E. Gallina

reply via email to

[Prev in Thread] Current Thread [Next in Thread]