[Top][All Lists]

[Date Prev][Date Next][Thread Prev][Thread Next][Date Index][Thread Index]

Re: still getting build errors

From: Randal L. Schwartz
Subject: Re: still getting build errors
Date: Thu, 12 Jul 2012 09:08:50 -0700
User-agent: Gnus/5.13 (Gnus v5.13) Emacs/23.4 (berkeley-unix)

And I'm getting build errors in nsterm.m (since two days ago):

/Users/merlyn/MIRROR/emacs-GIT/src/../lib               -MMD -MF deps/nsterm.d 
-MP     -g -O2  nsterm.m
nsterm.m: In function 'ns_timeout':
nsterm.m:422: error: 'timeout' undeclared (first use in this function)
nsterm.m:422: error: (Each undeclared identifier is reported only once
nsterm.m:422: error: for each function it appears in.)
nsterm.m: In function 'ns_get_color':
nsterm.m:1449: warning: passing argument 2 of '__builtin___snprintf_chk' makes 
integer from pointer without a cast
nsterm.m:1449: warning: passing argument 5 of '__builtin___snprintf_chk' makes 
pointer from integer without a cast
make[2]: *** [nsterm.o] Error 1
make[1]: *** [src] Error 2
make: *** [bootstrap] Error 2

Randal L. Schwartz - Stonehenge Consulting Services, Inc. - +1 503 777 0095
<address@hidden> <URL:http://www.stonehenge.com/merlyn/>
Smalltalk/Perl/Unix consulting, Technical writing, Comedy, etc. etc.
See http://methodsandmessages.posterous.com/ for Smalltalk discussion

reply via email to

[Prev in Thread] Current Thread [Next in Thread]