[Top][All Lists]

[Date Prev][Date Next][Thread Prev][Thread Next][Date Index][Thread Index]

Windows build failure

From: Dani Moncayo
Subject: Windows build failure
Date: Sun, 29 Jul 2012 18:40:08 +0200


With the current trunk (bzr revno 109266), I get this error when
trying to build the Windows binaries (mingw32-make bootstrap):

gcc -I. -c -gdwarf-2 -g3  -DEMACSDEBUG -fno-crossjumping
nclude -I../../libs/libxml2-2.7.8-w32-bin/include/libxml2
-I../../libs/giflib-4.1.4-1/include -I../.
./emacs/libs/gnutls-3.0.16/include -I../../libs/jpeg-6b-4/include
-I../../libs/libpng-1.4.10 -I../..
/libs/libxpm-3.5.8/include -I../../libs/libxpm-3.5.8/src
-I../../libs/tiff-3.8.2-1/include -I../../l
ibs/zlib-1.2.6 -I. -I../nt/inc -I../src -o oo/i386/dtotimespec.o dtotimespec.c
mingw32-make -w getopt_.h-SH
[Please ignore a syntax error on the next line - it is intentional]
/usr/bin/sh: -c: line 0: unexpected EOF while looking for matching `"'
/usr/bin/sh: -c: line 1: syntax error: unexpected end of file
mingw32-make[2]: Entering directory `C:/emacs/trunk/lib'
getopt.in.h or ../build-aux/snippet/arg-nonnull.h is newer than getopt_.h.
Run "gmake getopt_h" in the lib/ subdirectory.
You will need GNU Sed to be installed.
exit -1
mingw32-make[2]: *** [getopt_.h-SH] Error 255
mingw32-make[2]: Leaving directory `C:/emacs/trunk/lib'
mingw32-make[1]: *** [getopt_.h] Error 2
mingw32-make[1]: Leaving directory `C:/emacs/trunk/lib'
mingw32-make: *** [bootstrap-gmake] Error 2

Dani Moncayo

reply via email to

[Prev in Thread] Current Thread [Next in Thread]