[Top][All Lists]

[Date Prev][Date Next][Thread Prev][Thread Next][Date Index][Thread Index]

windows build failure

From: Sean Sieger
Subject: windows build failure
Date: Sun, 26 May 2013 16:29:36 -0400

In file included from w32.c:33:0:
../nt/inc/sys/time.h:41:62: error: conflicting types for 'restrict'
../nt/inc/sys/time.h:41:35: note: previous definition of 'restrict' was here
make[3]: *** [oo-spd/i386/w32.o] Error 1
make[3]: Leaving directory `c:/trunk/src'
make[2]: *** [bootstrap-temacs-CMD] Error 2
make[2]: Leaving directory `c:/trunk/src'
make[1]: *** [bootstrap-temacs] Error 2
make[1]: Leaving directory `c:/trunk/src'
make: *** [bootstrap-gmake] Error 2

reply via email to

[Prev in Thread] Current Thread [Next in Thread]