[Top][All Lists]

[Date Prev][Date Next][Thread Prev][Thread Next][Date Index][Thread Index]

Re: build error on osx

From: Jean-Christophe Helary
Subject: Re: build error on osx
Date: Sun, 13 Aug 2017 19:40:28 +0200

More problems with the build process (just made a git pull):

  ELC      ../lisp/emacs-lisp/tabulated-list.elc
Reloading stale files.el
Loading /Users/suzume/Documents/Code/emacs/lisp/files.el (source)...
Reloading stale faces.el
Loading /Users/suzume/Documents/Code/emacs/lisp/faces.el (source)...
Reloading stale loaddefs.el
Loading /Users/suzume/Documents/Code/emacs/lisp/loaddefs.el (source)...
Reloading stale simple.el
Loading /Users/suzume/Documents/Code/emacs/lisp/simple.el (source)...
Reloading stale tabulated-list.el
Loading /Users/suzume/Documents/Code/emacs/lisp/emacs-lisp/tabulated-list.el 
>>Error occurred processing ../lisp/emacs-lisp/tabulated-list.el: Symbol's 
>>function definition is void ((make-temp-file-internal))
make[2]: *** [../lisp/emacs-lisp/tabulated-list.elc] Error 1
make[1]: *** [../lisp/emacs-lisp/tabulated-list.elc] Error 2
make: *** [src] Error 2

Any idea ?


> On Aug 12, 2017, at 9:33, Jean-Christophe Helary <address@hidden> wrote:
>> On Aug 12, 2017, at 1:09, Paul Eggert <address@hidden> wrote:
>> I suggest "make bootstrap", or failing that, rebuilding from a fresh 
>> checkout.
> Thank you for the hint Paul. It looks like make was looking for a makeinfo >= 
> 4.13 that I had but the path did not catch it. So I reorganized my path and 
> things seem to work fine now.
> Jean-Christophe

reply via email to

[Prev in Thread] Current Thread [Next in Thread]