[Top][All Lists]

[Date Prev][Date Next][Thread Prev][Thread Next][Date Index][Thread Index]

Re: build error on osx

From: Paul Eggert
Subject: Re: build error on osx
Date: Sun, 13 Aug 2017 11:07:21 -0700
User-agent: Mozilla/5.0 (X11; Linux x86_64; rv:52.0) Gecko/20100101 Thunderbird/52.2.1

Jean-Christophe Helary wrote:
Error occurred processing ../lisp/emacs-lisp/tabulated-list.el: Symbol's 
function definition is void ((make-temp-file-internal))
make[2]: *** [../lisp/emacs-lisp/tabulated-list.elc] Error 1
make[1]: *** [../lisp/emacs-lisp/tabulated-list.elc] Error 2
make: *** [src] Error 2

Any idea ?

Looks like you're building with an out-of-date Emacs. Try "make bootstrap", and if that doesn't work, a fresh checkout.

reply via email to

[Prev in Thread] Current Thread [Next in Thread]