[Top][All Lists]

[Date Prev][Date Next][Thread Prev][Thread Next][Date Index][Thread Index]

[O] test failures on recent pull

From: Nick Dokos
Subject: [O] test failures on recent pull
Date: Mon, 04 Nov 2013 12:29:22 -0500
User-agent: Gnus/5.13 (Gnus v5.13) Emacs/24.3.50 (gnu/linux)

I just pulled and did a ``make test'':

org-loaddefs: 8.2.1 (release_8.2.1-191-g28f4b8)
Ran 471 tests, 467 results as expected, 4 unexpected (2013-11-04 12:18:23-0500)
5 expected failures

4 unexpected results:
   FAILED  ob-exp/evaluate-all-executables-in-order
   FAILED  ob-exp/export-call-line-information
   FAILED  ob-exp/use-case-of-reading-entry-properties
   FAILED  test-ob-lob/export-lob-lines


reply via email to

[Prev in Thread] Current Thread [Next in Thread]