[Top][All Lists]

[Date Prev][Date Next][Thread Prev][Thread Next][Date Index][Thread Index]

[Gm2] Mac OS X Intel Build Failure

From: Michael Lambert
Subject: [Gm2] Mac OS X Intel Build Failure
Date: Mon, 13 Oct 2008 22:49:10 -0400

Hi Gaius,

Under Mac OS X Intel, the build (with current CVS updates) is now failing on

./xgm2 -fcheck-all -g -funbounded-by-reference -fiso -fextended- opaque -Wpedantic-cast -Wpedantic-param-names -c -B./stage1/gm2 -g - B./ -Igm2/gm2-libs-iso:../../gcc-4.1.2/gcc/gm2/gm2-libs-iso -I../../ gcc-4.1.2/gcc/gm2/gm2-libs ../../gcc-4.1.2/gcc/gm2/gm2-libs-iso/ IOChan.mod -o gm2/gm2-libs-iso/IOChan.o ../../gcc-4.1.2/gcc/gm2/gm2-libs-iso/IOChan.mod:95:10: error: assignment designator and expression types are incompatible (_T68) and (notAvailable)
make[2]: *** [gm2/gm2-libs-iso/IOChan.o] Error 1
make[1]: *** [all-gcc] Error 2
make: *** [all] Error 2


reply via email to

[Prev in Thread] Current Thread [Next in Thread]