[Top][All Lists]

[Date Prev][Date Next][Thread Prev][Thread Next][Date Index][Thread Index]

[Gnash-commit] [bug #38573] Gnash 0.8.11dev failed to build with FFmpeg

From: Nachanon Vetjasit
Subject: [Gnash-commit] [bug #38573] Gnash 0.8.11dev failed to build with FFmpeg r11872/libavcodec 51.50.0
Date: Fri, 22 Mar 2013 16:54:32 +0000
User-agent: Opera/9.64 (X11; Linux i686; U; en) Presto/2.1.1

Follow-up Comment #5, bug #38573 (project gnash):

@Sandro Santilli
Oh sorry, I didn't see your post.
The first bad bisect output did not contains all the build error, because this
bug involved four commits: 80989fcd, dfba5258, 4b3dae97 and 63cb1b76.

This is an error that really appeared in the first bad commit build

In file included from ffmpeg/AudioDecoderFfmpeg.cpp:27:
ffmpeg/MediaParserFfmpeg.h:157: error: ISO C++ forbids declaration of
'AVIOContext' with no type
ffmpeg/MediaParserFfmpeg.h:157: error: expected ';' before '*' token
ffmpeg/MediaParserFfmpeg.h:175: error: 'AVSampleFormat' has not been declared
ffmpeg/AudioDecoderFfmpeg.cpp: In member function 'void
ffmpeg/AudioDecoderFfmpeg.cpp:159: error: 'AV_SAMPLE_FMT_S16' was not declared
in this scope
ffmpeg/AudioDecoderFfmpeg.cpp: In member function 'void
ffmpeg/AudioDecoderFfmpeg.cpp:297: error: 'AV_SAMPLE_FMT_S16' was not declared
in this scope
make[2]: *** [libgnashmedia_la-AudioDecoderFfmpeg.lo] Error 1
make[2]: Leaving directory `/home/window/build/gnashgit/libmedia'
make[1]: *** [all-recursive] Error 1
make[1]: Leaving directory `/home/window/build/gnashgit'
make: *** [all] Error 2


Reply to this item at:


  Message sent via/by Savannah

reply via email to

[Prev in Thread] Current Thread [Next in Thread]