[Top][All Lists]

[Date Prev][Date Next][Thread Prev][Thread Next][Date Index][Thread Index]

[Gnash-dev] SOS cannt compile the v0.7.2

From: 越峰裴
Subject: [Gnash-dev] SOS cannt compile the v0.7.2
Date: Mon, 23 Apr 2007 10:05:28 +0800

i downed gnash 0.7.2 source in ubuntu kernel 2.6.15.
but when run ./make,  i meet many errors ,the out put is like this:

container.h:625: error: expected template-name before '<' token
container.h:625: error: expected `{' before '<' token
container.h:625: error: expected unqualified-id before '<' token
container.cpp: In static member function 'static int tu_string::stricmp(const char*, const char*)':
container.cpp:177: error: '_stricmp' was not declared in this scope
make[2]: *** [container.lo] Error 1
make[2]: Leaving directory `/mnt/hgfs/share/source/gnash-0.7.2/libbase'
make[1]: *** [all-recursive] Error 1
make[1]: Leaving directory `/mnt/hgfs/share/source/gnash-0.7.2'
make: *** [all] Error 2

i try to fixed some code. but when make server subdirectory  , i met too much error.
i think the release version should not be so difficult to compile. maybe something else cause this.

can somebody tell me why  and solve this problem.

Pei Yuefeng

reply via email to

[Prev in Thread] Current Thread [Next in Thread]