[Top][All Lists]

[Date Prev][Date Next][Thread Prev][Thread Next][Date Index][Thread Index]

[Gnash-dev] make check failing to finish

From: dolphinling
Subject: [Gnash-dev] make check failing to finish
Date: Sun, 13 May 2007 06:04:24 -0400
User-agent: Thunderbird (X11/20070326)

make check is failing to finish for me:

Preprocessing ./ done.
Compiling `./' into frame 2... failed:
  asm { push 'val',4 tonumber
  Line 244:  Reason: 'syntax error'
make[4]: *** [Number.swf] Error 1
make[4]: Leaving directory `/home/dolphinling/gnash/cleanhead/gnash/testsuite/actionscript.all'
make[3]: *** [Number-v5.swf] Error 2
make[3]: Leaving directory `/home/dolphinling/gnash/cleanhead/gnash/testsuite/actionscript.all'
make[2]: *** [check-am] Error 2
make[2]: Leaving directory `/home/dolphinling/gnash/cleanhead/gnash/testsuite/actionscript.all'
make[1]: *** [check-recursive] Error 1
make[1]: Leaving directory `/home/dolphinling/gnash/cleanhead/gnash/testsuite'
make: *** [check-recursive] Error 1

It's *very* possible I'm missing a library or something (this is the first time I've tried to run make check), but this doesn't look like that to my untrained eye. I can provide any info if you tell me what you need.


reply via email to

[Prev in Thread] Current Thread [Next in Thread]