[Top][All Lists]

[Date Prev][Date Next][Thread Prev][Thread Next][Date Index][Thread Index]

Re: [Gnash-dev] Anyone having build troubles on 'make check' ?

From: Craig Kelley
Subject: Re: [Gnash-dev] Anyone having build troubles on 'make check' ?
Date: Wed, 27 Jan 2010 10:41:38 -0700 (MST)
User-agent: Alpine 2.00 (DEB 1167 2008-08-23)

On Wed, 27 Jan 2010, strk wrote:

I'm having troubles with the linking phase for the testsuite
on an Ubuntu 8.10 but it seems none of the core developers
can reproduce the problem.

Does anyone else see such problem ?

I checked out git this AM, and this is what i get with Ubuntu 9.10:

Opening sound file: ./../media/brokenchord.wav
Exporting a character of type 14 is not supportedmake[4]: *** [eventSoundTest1.swf] Error 1 make[4]: Leaving directory `/usr/local/work/Gnash/git/trunk/testsuite/misc-ming.all'
make[3]: *** [check-am] Error 2
make[3]: Leaving directory `/usr/local/work/Gnash/git/trunk/testsuite/misc-ming.all'
make[2]: *** [check-recursive] Error 1
make[2]: Leaving directory `/usr/local/work/Gnash/git/trunk/testsuite'
make[1]: *** [check-recursive] Error 1
make[1]: Leaving directory `/usr/local/work/Gnash/git/trunk'
make: *** [check] Error 2

Craig Kelley finger same server for PGP block

reply via email to

[Prev in Thread] Current Thread [Next in Thread]