[Top][All Lists]

[Date Prev][Date Next][Thread Prev][Thread Next][Date Index][Thread Index]

error building base

From: Riccardo Mottola
Subject: error building base
Date: Fri, 04 Jan 2008 16:35:07 +0100
User-agent: GNUMail (Version (nil))


while building gnustep-base inside an RPM I get an error of this kind:

Making all in SSL...
make[1]: Entering directory `/usr/src/redhat/BUILD/gnustep-base-1.15.2/SSL'
Making all for bundle SSL...
 Creating SSL.bundle/....
 Compiling file GSSSLHandle.m ...
 Linking bundle SSL ...
/usr/bin/ld: cannot find -lgnustep-gui
collect2: ld returned 1 exit status
make[2]: *** [SSL.bundle/./SSL] Error 1
make[1]: *** [SSL.all.bundle.variables] Error 2

gui required by base???

I use gnustep-make 2.0.1 since 2.0.2 doesn't install due to missing documentation



reply via email to

[Prev in Thread] Current Thread [Next in Thread]