gnutls-commit
[Top][All Lists]
Advanced

[Date Prev][Date Next][Thread Prev][Thread Next][Date Index][Thread Index]

Hydra job gnu:gnutls-master:manual build 1957152: Failed with non-zero e


From: Hydra Build Daemon
Subject: Hydra job gnu:gnutls-master:manual build 1957152: Failed with non-zero exit code
Date: Sun, 29 Jan 2012 16:16:51 +0100

Hi,

This is to let you know that Hydra build 1957152 of job 
gnu:gnutls-master:manual has changed from 'Success' to 'Failed with non-zero 
exit code'.

Complete build information can be found on this page: 
http://hydra.nixos.org/build/1957152

The last 50 lines of the build log are shown at the bottom of this email.

A summary of the build information follows:

Build ID:              | 1957152
Nix name:              | gnutls-manual-3.0.12
Short description:     | Native Nix build on x86_64-linux
Maintainer(s):         | address@hidden, address@hidden
System:                | x86_64-linux
Derivation store path: | 
/nix/store/y38q4vvxbx16kqv2ydskh7dxwr4vc2zy-gnutls-manual-3.0.12.drv
Output store path:     | 
/nix/store/0hbfh7p14mhadb3gzixyvw11k7z9mbi8-gnutls-manual-3.0.12
Time added:            | 2012-01-29 16:16:51
Build started:         | 2012-01-29 16:13:49
Build finished:        | 2012-01-29 16:16:51
Duration:              | 182s

The build inputs were:

Name        | Type     | Value
------------+----------+--------------------------------------------------------------------------------------
hydraConfig | git      | 
git://git.savannah.gnu.org/hydra-recipes.git:dcfdb39bcd9f7a3d56f9d897e2d7c04712b64b6f
nixpkgs     | svn      | https://nixos.org/repos/nix/nixpkgs/trunk:31913
tarball     | build    | 1957145
libtasn1    | sysbuild | 1931065
libgcrypt   | sysbuild | 1927506

Regards,

The Hydra build daemon.

---
make[4]: autogen: Command not found
make[4]: [p11tool.1] Error 127 (ignored)
building ocsptool.1
autogen -DMAN_SECTION=1 -Tagman-cmd.tpl ../../src/ocsptool-args.def
make[4]: autogen: Command not found
make[4]: [ocsptool.1] Error 127 (ignored)
building srptool.1
autogen -DMAN_SECTION=1 -Tagman-cmd.tpl ../../src/srptool-args.def
make[4]: autogen: Command not found
make[4]: [srptool.1] Error 127 (ignored)
make[4]: Leaving directory 
`/tmp/nix-build-y38q4vvxbx16kqv2ydskh7dxwr4vc2zy-gnutls-manual-3.0.12.drv-0/gnutls-3.0.12/doc/manpages'
Making all in credentials
make[4]: Entering directory 
`/tmp/nix-build-y38q4vvxbx16kqv2ydskh7dxwr4vc2zy-gnutls-manual-3.0.12.drv-0/gnutls-3.0.12/doc/credentials'
building all-recursive
Making all in openpgp
make[5]: Entering directory 
`/tmp/nix-build-y38q4vvxbx16kqv2ydskh7dxwr4vc2zy-gnutls-manual-3.0.12.drv-0/gnutls-3.0.12/doc/credentials/openpgp'
make[5]: Nothing to be done for `all'.
make[5]: Leaving directory 
`/tmp/nix-build-y38q4vvxbx16kqv2ydskh7dxwr4vc2zy-gnutls-manual-3.0.12.drv-0/gnutls-3.0.12/doc/credentials/openpgp'
Making all in srp
make[5]: Entering directory 
`/tmp/nix-build-y38q4vvxbx16kqv2ydskh7dxwr4vc2zy-gnutls-manual-3.0.12.drv-0/gnutls-3.0.12/doc/credentials/srp'
make[5]: Nothing to be done for `all'.
make[5]: Leaving directory 
`/tmp/nix-build-y38q4vvxbx16kqv2ydskh7dxwr4vc2zy-gnutls-manual-3.0.12.drv-0/gnutls-3.0.12/doc/credentials/srp'
Making all in x509
make[5]: Entering directory 
`/tmp/nix-build-y38q4vvxbx16kqv2ydskh7dxwr4vc2zy-gnutls-manual-3.0.12.drv-0/gnutls-3.0.12/doc/credentials/x509'
make[5]: Nothing to be done for `all'.
make[5]: Leaving directory 
`/tmp/nix-build-y38q4vvxbx16kqv2ydskh7dxwr4vc2zy-gnutls-manual-3.0.12.drv-0/gnutls-3.0.12/doc/credentials/x509'
make[5]: Entering directory 
`/tmp/nix-build-y38q4vvxbx16kqv2ydskh7dxwr4vc2zy-gnutls-manual-3.0.12.drv-0/gnutls-3.0.12/doc/credentials'
make[5]: Nothing to be done for `all-am'.
make[5]: Leaving directory 
`/tmp/nix-build-y38q4vvxbx16kqv2ydskh7dxwr4vc2zy-gnutls-manual-3.0.12.drv-0/gnutls-3.0.12/doc/credentials'
make[4]: Leaving directory 
`/tmp/nix-build-y38q4vvxbx16kqv2ydskh7dxwr4vc2zy-gnutls-manual-3.0.12.drv-0/gnutls-3.0.12/doc/credentials'
Making all in latex
make[4]: Entering directory 
`/tmp/nix-build-y38q4vvxbx16kqv2ydskh7dxwr4vc2zy-gnutls-manual-3.0.12.drv-0/gnutls-3.0.12/doc/latex'
make[4]: Nothing to be done for `all'.
make[4]: Leaving directory 
`/tmp/nix-build-y38q4vvxbx16kqv2ydskh7dxwr4vc2zy-gnutls-manual-3.0.12.drv-0/gnutls-3.0.12/doc/latex'
make[4]: Entering directory 
`/tmp/nix-build-y38q4vvxbx16kqv2ydskh7dxwr4vc2zy-gnutls-manual-3.0.12.drv-0/gnutls-3.0.12/doc'
building invoke-gnutls-cli.texi
cd ../src/ && autogen -Tagtexi-cmd.tpl ../src/cli-args.def
/bin/sh: autogen: command not found
make[4]: *** [invoke-gnutls-cli.texi] Error 127
make[4]: Leaving directory 
`/tmp/nix-build-y38q4vvxbx16kqv2ydskh7dxwr4vc2zy-gnutls-manual-3.0.12.drv-0/gnutls-3.0.12/doc'
make[3]: *** [all-recursive] Error 1
make[3]: Leaving directory 
`/tmp/nix-build-y38q4vvxbx16kqv2ydskh7dxwr4vc2zy-gnutls-manual-3.0.12.drv-0/gnutls-3.0.12/doc'
make[2]: *** [all] Error 2
make[2]: Leaving directory 
`/tmp/nix-build-y38q4vvxbx16kqv2ydskh7dxwr4vc2zy-gnutls-manual-3.0.12.drv-0/gnutls-3.0.12/doc'
make[1]: *** [all-recursive] Error 1
make[1]: Leaving directory 
`/tmp/nix-build-y38q4vvxbx16kqv2ydskh7dxwr4vc2zy-gnutls-manual-3.0.12.drv-0/gnutls-3.0.12'
make: *** [all] Error 2
build time elapsed:  0m0.044s 0m0.016s 2m3.525s 0m47.357s
builder for 
`/nix/store/y38q4vvxbx16kqv2ydskh7dxwr4vc2zy-gnutls-manual-3.0.12.drv' failed 
with exit code 2
error: build of 
`/nix/store/y38q4vvxbx16kqv2ydskh7dxwr4vc2zy-gnutls-manual-3.0.12.drv' failed



reply via email to

[Prev in Thread] Current Thread [Next in Thread]