[Top][All Lists]

[Date Prev][Date Next][Thread Prev][Thread Next][Date Index][Thread Index]

[gpsd-dev] errors from scons testregress: Trimble-lassen

From: Hal Murray
Subject: [gpsd-dev] errors from scons testregress: Trimble-lassen
Date: Sat, 05 May 2012 18:38:20 -0700

I'm not familiar with the gpsd build/test environment.  On a recent git pull, 
scons (build) seemed happy, but scons testregress gives the following errors:

Regression test FAILED: 3 errors in 78 tests total (0 not found).
The following test Failed:
Elapsed time: 281
scons: *** [gps-regress] Error 3
scons: building terminated because of errors.

Looking way back, I see something like this for all 3 cases:

Processing test/daemon/trimble-lassen_iq-3dfix.log
Traceback (most recent call last):
  File "/home/murray/gpsd/gpsd-git/gpsfake", line 171, in <module>
    test.gps_add(logfile, speed=speed, pred=fakehook)
  File "/home/murray/gpsd/gpsd-git/gps/", line 453, in gps_add
  File "/home/murray/gpsd/gpsd-git/gps/", line 249, in __init__
    [iflag, oflag, cflag, lflag, ispeed, ospeed, cc])
termios.error: (22, 'Invalid argument')
--- test/daemon/trimble-lassen_iq-3dfix.log.chk 2011-10-24 01:29:33.000000000 
+++ /tmp/gpsd-test-uK66kjQzdvfWn0/test-4743.chk 2012-05-05 18:24:53.000000000 
@@ -1,251 +0,0 @@

I'm running on a old Fedora box.  Kernel is with my local config 

Is this a known problem area?  If not, what do I do to help track it down?

These are my opinions, not necessarily my employer's.  I hate spam.

reply via email to

[Prev in Thread] Current Thread [Next in Thread]