[Top][All Lists]

[Date Prev][Date Next][Thread Prev][Thread Next][Date Index][Thread Index]

[Guile-commits] Hydra job gnu:guile-master:build build 774976: Failed wi

From: Hydra Build Daemon
Subject: [Guile-commits] Hydra job gnu:guile-master:build build 774976: Failed with non-zero exit code
Date: Thu, 2 Dec 2010 18:18:41 +0100


This is to let you know that Hydra build 774976 of job gnu:guile-master:build 
has changed from 'Success' to 'Failed with non-zero exit code'.

Complete build information can be found on this page:

The last 50 lines of the build log are shown at the bottom of this email.

A summary of the build information follows:

Build ID:              | 774976
Nix name:              | guile-
Short description:     | Native Nix build on x86_64-linux
Maintainer(s):         | address@hidden
System:                | x86_64-linux
Derivation store path: | 
Output store path:     | 
Time added:            | 2010-12-02 18:18:41
Build started:         | 2010-12-02 18:08:13
Build finished:        | 2010-12-02 18:18:41
Duration:              | 628s

The build inputs were:

Name        | Type   | Value
hydraConfig | svn    |
nixpkgs     | svn    |
system      | string | x86_64-linux
tarball     | build  | 774542


The Hydra build daemon.

wrote `system/base/language.go'
building system/base/lalr.go
  GUILEC system/base/lalr.go
wrote `system/base/lalr.go'
building system/base/message.go
  GUILEC system/base/message.go
wrote `system/base/message.go'
building ice-9/r4rs.go
  GUILEC ice-9/r4rs.go
wrote `ice-9/r4rs.go'
building ice-9/r5rs.go
  GUILEC ice-9/r5rs.go
wrote `ice-9/r5rs.go'
building ice-9/deprecated.go
  GUILEC ice-9/deprecated.go
wrote `ice-9/deprecated.go'
building ice-9/and-let-star.go
  GUILEC ice-9/and-let-star.go
wrote `ice-9/and-let-star.go'
building ice-9/calling.go
  GUILEC ice-9/calling.go
wrote `ice-9/calling.go'
building ice-9/common-list.go
  GUILEC ice-9/common-list.go
wrote `ice-9/common-list.go'
building ice-9/control.go
  GUILEC ice-9/control.go
wrote `ice-9/control.go'
building ice-9/curried-definitions.go
  GUILEC ice-9/curried-definitions.go
wrote `ice-9/curried-definitions.go'
building ice-9/debug.go
  GUILEC ice-9/debug.go
wrote `ice-9/debug.go'
building ice-9/documentation.go
  GUILEC ice-9/documentation.go
wrote `ice-9/documentation.go'
building ice-9/expect.go
  GUILEC ice-9/expect.go
wrote `ice-9/expect.go'
building ice-9/format.go
make[2]: /bin/sh: Command not found
make[2]: *** [ice-9/format.go] Error 127
make[2]: Leaving directory 
make[1]: *** [all-recursive] Error 1
make[1]: Leaving directory 
make: *** [all] Error 2
build time elapsed:  0m0.017s 0m0.010s 9m20.143s 0m36.864s
builder for 
`/nix/store/78wfpcn20nhyzk7p3frpfa0a2liphl81-guile-' failed 
with exit code 2
error: build of 
`/nix/store/78wfpcn20nhyzk7p3frpfa0a2liphl81-guile-' failed

reply via email to

[Prev in Thread] Current Thread [Next in Thread]