[Top][All Lists]

[Date Prev][Date Next][Thread Prev][Thread Next][Date Index][Thread Index]

[Guile-commits] Hydra job gnu:guile-master:build_CPPFLAGS=_DSCM_DEBUG=1

From: Hydra Build Daemon
Subject: [Guile-commits] Hydra job gnu:guile-master:build_CPPFLAGS=_DSCM_DEBUG=1 build 774972: Failed with non-zero exit code
Date: Thu, 2 Dec 2010 18:18:55 +0100


This is to let you know that Hydra build 774972 of job 
gnu:guile-master:build_CPPFLAGS=_DSCM_DEBUG=1 has changed from 'Success' to 
'Failed with non-zero exit code'.

Complete build information can be found on this page:

The last 50 lines of the build log are shown at the bottom of this email.

A summary of the build information follows:

Build ID:              | 774972
Nix name:              | guile-CPPFLAGS=-DSCM_DEBUG=1-
Short description:     | Native Nix build on x86_64-linux
Maintainer(s):         | address@hidden
System:                | x86_64-linux
Derivation store path: | 
Output store path:     | 
Time added:            | 2010-12-02 18:18:55
Build started:         | 2010-12-02 18:08:13
Build finished:        | 2010-12-02 18:18:55
Duration:              | 642s

The build inputs were:

Name        | Type  | Value
hydraConfig | svn   |
nixpkgs     | svn   |
tarball     | build | 774542


The Hydra build daemon.

building trees.doc
  SNARF  trees.doc
building uniform.doc
  SNARF  uniform.doc
building values.doc
  SNARF  values.doc
building variable.doc
  SNARF  variable.doc
building vectors.doc
  SNARF  vectors.doc
building version.doc
  SNARF  version.doc
building vports.doc
  SNARF  vports.doc
building weaks.doc
  SNARF  weaks.doc
building filesys.doc
  SNARF  filesys.doc
building posix.doc
  SNARF  posix.doc
building net_db.doc
  SNARF  net_db.doc
building socket.doc
  SNARF  socket.doc
building regex-posix.doc
  SNARF  regex-posix.doc
building guile-procedures.texi
  GEN    guile-procedures.texi
building guile-procedures.txt
cp guile-procedures.texi guile-procedures.txt
make[3]: Leaving directory 
make[2]: Leaving directory 
Making all in module
make[2]: Entering directory 
building ice-9/eval.go
  GUILEC ice-9/eval.go
wrote `ice-9/eval.go'
building ice-9/psyntax-pp.go
  GUILEC ice-9/psyntax-pp.go
wrote `ice-9/psyntax-pp.go'
building ice-9/boot-9.go
make[2]: /bin/sh: Command not found
make[2]: *** [ice-9/boot-9.go] Error 127
make[2]: Leaving directory 
make[1]: *** [all-recursive] Error 1
make[1]: Leaving directory 
make: *** [all] Error 2
build time elapsed:  0m0.017s 0m0.014s 9m37.901s 0m35.733s
builder for 
 failed with exit code 2
error: build of 

reply via email to

[Prev in Thread] Current Thread [Next in Thread]