[Top][All Lists]

[Date Prev][Date Next][Thread Prev][Thread Next][Date Index][Thread Index]

[Guile-commits] Hydra job gnu:guile-master:build build 774985: Failed wi

From: Hydra Build Daemon
Subject: [Guile-commits] Hydra job gnu:guile-master:build build 774985: Failed with non-zero exit code
Date: Thu, 2 Dec 2010 18:25:29 +0100


This is to let you know that Hydra build 774985 of job gnu:guile-master:build 
has changed from 'Success' to 'Failed with non-zero exit code'.

Complete build information can be found on this page:

The last 50 lines of the build log are shown at the bottom of this email.

A summary of the build information follows:

Build ID:              | 774985
Nix name:              | guile-
Short description:     | Native Nix build on i686-linux
Maintainer(s):         | address@hidden
System:                | i686-linux
Derivation store path: | 
Output store path:     | 
Time added:            | 2010-12-02 18:25:29
Build started:         | 2010-12-02 18:08:13
Build finished:        | 2010-12-02 18:25:29
Duration:              | 1036s

The build inputs were:

Name        | Type   | Value
hydraConfig | svn    |
nixpkgs     | svn    |
system      | string | i686-linux
tarball     | build  | 774542


The Hydra build daemon.

wrote `language/elisp/parser.go'
building language/elisp/bindings.go
  GUILEC language/elisp/bindings.go
wrote `language/elisp/bindings.go'
building language/elisp/compile-tree-il.go
  GUILEC language/elisp/compile-tree-il.go
wrote `language/elisp/compile-tree-il.go'
building language/elisp/runtime.go
  GUILEC language/elisp/runtime.go
wrote `language/elisp/runtime.go'
building language/elisp/runtime/function-slot.go
  GUILEC language/elisp/runtime/function-slot.go
wrote `language/elisp/runtime/function-slot.go'
building language/elisp/runtime/macro-slot.go
  GUILEC language/elisp/runtime/macro-slot.go
wrote `language/elisp/runtime/macro-slot.go'
building language/elisp/runtime/value-slot.go
  GUILEC language/elisp/runtime/value-slot.go
wrote `language/elisp/runtime/value-slot.go'
building language/elisp/spec.go
  GUILEC language/elisp/spec.go
wrote `language/elisp/spec.go'
building language/brainfuck/parse.go
  GUILEC language/brainfuck/parse.go
wrote `language/brainfuck/parse.go'
building language/brainfuck/compile-scheme.go
  GUILEC language/brainfuck/compile-scheme.go
wrote `language/brainfuck/compile-scheme.go'
building language/brainfuck/compile-tree-il.go
  GUILEC language/brainfuck/compile-tree-il.go
wrote `language/brainfuck/compile-tree-il.go'
building language/brainfuck/spec.go
  GUILEC language/brainfuck/spec.go
wrote `language/brainfuck/spec.go'
building statprof.go
  GUILEC statprof.go
wrote `statprof.go'
building sxml/apply-templates.go
  GUILEC sxml/apply-templates.go
wrote `sxml/apply-templates.go'
building sxml/fold.go
make[2]: /bin/sh: Command not found
make[2]: *** [sxml/fold.go] Error 127
make[2]: Leaving directory 
make[1]: *** [all-recursive] Error 1
make[1]: Leaving directory 
make: *** [all] Error 2
build time elapsed:  0m0.023s 0m0.007s 13m28.291s 0m33.990s
builder for 
`/nix/store/admjab35pps8w0k4p1f8la8wc4xcvhpp-guile-' failed 
with exit code 2
error: build of 
`/nix/store/admjab35pps8w0k4p1f8la8wc4xcvhpp-guile-' failed

reply via email to

[Prev in Thread] Current Thread [Next in Thread]