[Top][All Lists]

[Date Prev][Date Next][Thread Prev][Thread Next][Date Index][Thread Index]

[Guile-commits] Hydra job gnu:guile-master:coverage build 817034: Unknow

From: Hydra Build Daemon
Subject: [Guile-commits] Hydra job gnu:guile-master:coverage build 817034: Unknown failure
Date: Tue, 21 Dec 2010 06:06:16 +0100


This is to let you know that Hydra build 817034 of job 
gnu:guile-master:coverage has changed from 'Failed with non-zero exit code' to 
'Unknown failure'.

Complete build information can be found on this page:

The last 50 lines of the build log are shown at the bottom of this email.

A summary of the build information follows:

Build ID:              | 817034
Nix name:              | guile-coverage-
Short description:     | Coverage analysis
Maintainer(s):         | address@hidden
System:                | x86_64-linux
Derivation store path: | 
Output store path:     | 
Time added:            | 2010-12-21 06:06:16
Build started:         | 2010-12-21 05:44:21
Build finished:        | 2010-12-21 06:06:16
Duration:              | 1315s

The build inputs were:

Name        | Type  | Value
hydraConfig | svn   |
nixpkgs     | svn   |
tarball     | build | 816836


The Hydra build daemon.

make[5]: Nothing to be done for `test-system-cmds'.
make[5]: Nothing to be done for `test-bad-identifiers'.
make[5]: Nothing to be done for `test-require-extension'.
make[5]: Nothing to be done for `test-asmobs'.
make[5]: Nothing to be done for `test-ffi'.
make[5]: `test-fast-slot-ref' is up to date.
make[5]: `test-use-srfi' is up to date.
make[5]: Nothing to be done for `test-extensions'.
make[5]: Leaving directory 
make  check-TESTS
make[5]: Entering directory 
building check-TESTS
PASS: test-system-cmds
PASS: test-bad-identifiers
PASS: test-require-extension
PASS: test-num2integral
PASS: test-round
PASS: test-asmobs
PASS: test-ffi
PASS: test-list
PASS: test-unwind
PASS: test-conversion
PASS: test-loose-ends
PASS: test-fast-slot-ref
PASS: test-use-srfi
PASS: test-scm-c-read
PASS: test-scm-take-locale-symbol
PASS: test-scm-take-u8vector
PASS: test-extensions
PASS: test-with-guile-module
guile: uncaught throw to stack-overflow: (#f Stack overflow #f #f)
FAIL: test-scm-with-guile
1 of 19 tests failed
Please report to address@hidden
make[5]: *** [check-TESTS] Error 1
make[5]: Leaving directory 
make[4]: *** [check-am] Error 2
make[4]: Leaving directory 
make[3]: *** [check] Error 2
make[3]: Leaving directory 
make[2]: *** [check-recursive] Error 1
make[2]: Leaving directory 
make[1]: *** [check-recursive] Error 1
make[1]: Leaving directory 
make: *** [check] Error 2
build time elapsed:  0m0.014s 0m0.018s 19m59.852s 0m34.006s
builder for 
failed with exit code 2
error: build of 

reply via email to

[Prev in Thread] Current Thread [Next in Thread]