[Top][All Lists]

[Date Prev][Date Next][Thread Prev][Thread Next][Date Index][Thread Index]

[Guile-commits] Hydra job gnu:guile-2-0:build build 915884: Unknown fail

From: Hydra Build Daemon
Subject: [Guile-commits] Hydra job gnu:guile-2-0:build build 915884: Unknown failure
Date: Tue, 15 Feb 2011 18:59:25 +0100


This is to let you know that Hydra build 915884 of job gnu:guile-2-0:build is 
'Unknown failure'..

Complete build information can be found on this page:

The last 50 lines of the build log are shown at the bottom of this email.

A summary of the build information follows:

Build ID:              | 915884
Nix name:              | guile-
Short description:     | Native Nix build on i686-darwin
Maintainer(s):         | address@hidden
System:                | i686-darwin
Derivation store path: | 
Output store path:     | 
Time added:            | 2011-02-15 18:59:24
Build started:         | 2011-02-15 18:19:40
Build finished:        | 2011-02-15 18:59:24
Duration:              | 2384s

The build inputs were:

Name        | Type   | Value
hydraConfig | svn    |
nixpkgs     | svn    |
system      | string | i686-darwin
tarball     | build  | 914063


The Hydra build daemon.

UNRESOLVED: guardians.test: standard guardian functionality: guarding weak 
containers: element of guarded weak vector gets collected
Running hash.test
Running hooks.test
Running i18n.test
UNRESOLVED: i18n.test: text collation (French): string-locale<?
UNRESOLVED: i18n.test: text collation (French): char-locale<?
UNRESOLVED: i18n.test: text collation (French): string-locale-ci=?
UNRESOLVED: i18n.test: text collation (French): string-locale-ci<>?
UNRESOLVED: i18n.test: text collation (French): char-locale-ci<>?
UNRESOLVED: i18n.test: number parsing: locale-string->inexact (French)
UNRESOLVED: i18n.test: nl-langinfo et al.: locale-day (French)
UNRESOLVED: i18n.test: nl-langinfo et al.: locale-day (French, using 
UNRESOLVED: i18n.test: nl-langinfo et al.: default locale
UNRESOLVED: i18n.test: number->locale-string: French: integer
UNRESOLVED: i18n.test: number->locale-string: French: fraction
UNRESOLVED: i18n.test: number->locale-string: French: fraction, 1 digit
Running import.test
Running interp.test
Running keywords.test
Running list.test
Running load.test
Running match.test
Running modules.test
Running net-db.test
Running numbers.test
Running optargs.test
Running options.test
Running poe.test
Running popen.test
FAIL: popen.test: open-input-pipe: open-input-pipe process gets 
(current-input-port) as stdin
FAIL: popen.test: open-output-pipe: no duplicate
FAIL: popen.test: close-pipe: exit 0
FAIL: popen.test: close-pipe: exit 1
Running ports.test
FAIL: ports.test: pipe: read
FAIL: check-guile
1 of 1 test failed
Please report to address@hidden
make[3]: *** [check-TESTS] Error 1
make[3]: Leaving directory 
make[2]: *** [check-am] Error 2
make[2]: Leaving directory 
make[1]: *** [check-recursive] Error 1
make[1]: Leaving directory 
make: *** [check] Error 2
build time elapsed:  0m0.049s 0m0.035s 18m39.681s 1m49.140s
Copying build directory to 
build failed with exit code 2 (ignored)

reply via email to

[Prev in Thread] Current Thread [Next in Thread]