[Top][All Lists]

[Date Prev][Date Next][Thread Prev][Thread Next][Date Index][Thread Index]

[Guile-commits] Hydra job gnu:guile-master:build build 916445: Unknown f

From: Hydra Build Daemon
Subject: [Guile-commits] Hydra job gnu:guile-master:build build 916445: Unknown failure
Date: Wed, 16 Feb 2011 02:41:19 +0100


This is to let you know that Hydra build 916445 of job gnu:guile-master:build 
has changed from 'Success' to 'Unknown failure'.

Complete build information can be found on this page:

The last 50 lines of the build log are shown at the bottom of this email.

A summary of the build information follows:

Build ID:              | 916445
Nix name:              | guile-
Short description:     | Native Nix build on i686-freebsd
Maintainer(s):         | address@hidden
System:                | i686-freebsd
Derivation store path: | 
Output store path:     | 
Time added:            | 2011-02-16 02:41:19
Build started:         | 2011-02-16 02:22:16
Build finished:        | 2011-02-16 02:41:19
Duration:              | 1143s

The build inputs were:

Name        | Type   | Value
hydraConfig | svn    |
nixpkgs     | svn    |
system      | string | i686-freebsd
tarball     | build  | 916422


The Hydra build daemon.

gmake[5]: `test-fast-slot-ref' is up to date.
gmake[5]: `test-use-srfi' is up to date.
gmake[5]: Nothing to be done for `test-extensions'.
gmake[5]: Leaving directory 
gmake  check-TESTS
gmake[5]: Entering directory 
PASS: test-system-cmds
PASS: test-bad-identifiers
PASS: test-require-extension
PASS: test-num2integral
PASS: test-round
PASS: test-asmobs
PASS: test-ffi
PASS: test-list
PASS: test-unwind
PASS: test-conversion
PASS: test-loose-ends
PASS: test-fast-slot-ref
 line 64: 44257 Segmentation fault: 11  (core dumped) guile -q --use-srfi=17 > 
/dev/null  <<EOF
(if (procedure-with-setter? car)
    (exit 0)   ;; good
    (exit 1))  ;; bad

guile --use-srfi=17 doesn't give SRFI-17 car
FAIL: test-use-srfi
PASS: test-scm-c-read
PASS: test-scm-take-locale-symbol
PASS: test-scm-take-u8vector
PASS: test-extensions
PASS: test-with-guile-module
PASS: test-scm-with-guile
1 of 19 tests failed
Please report to address@hidden
gmake[5]: *** [check-TESTS] Error 1
gmake[5]: Leaving directory 
gmake[4]: *** [check-am] Error 2
gmake[4]: Leaving directory 
gmake[3]: *** [check] Error 2
gmake[3]: Leaving directory 
gmake[2]: *** [check-recursive] Error 1
gmake[2]: Leaving directory 
gmake[1]: *** [check-recursive] Error 1
gmake[1]: Leaving directory 
gmake: *** [check] Error 2
build time elapsed:  0m0.021s 0m0.021s 11m50.753s 0m32.782s
Copying build directory to 
build failed with exit code 2 (ignored)

reply via email to

[Prev in Thread] Current Thread [Next in Thread]