[Top][All Lists]

[Date Prev][Date Next][Thread Prev][Thread Next][Date Index][Thread Index]

[Guile-commits] Hydra job gnu:guile-2-0:build build 945012: Unknown fail

From: Hydra Build Daemon
Subject: [Guile-commits] Hydra job gnu:guile-2-0:build build 945012: Unknown failure
Date: Thu, 3 Mar 2011 13:56:28 +0100


This is to let you know that Hydra build 945012 of job gnu:guile-2-0:build has 
changed from 'Success' to 'Unknown failure'.

Complete build information can be found on this page:

The last 50 lines of the build log are shown at the bottom of this email.

A summary of the build information follows:

Build ID:              | 945012
Nix name:              | guile-
Short description:     | Native Nix build on i686-freebsd
Maintainer(s):         | address@hidden
System:                | i686-freebsd
Derivation store path: | 
Output store path:     | 
Time added:            | 2011-03-03 13:56:28
Build started:         | 2011-03-03 13:38:38
Build finished:        | 2011-03-03 13:56:28
Duration:              | 1070s

The build inputs were:

Name        | Type   | Value
hydraConfig | svn    |
nixpkgs     | svn    |
system      | string | i686-freebsd
tarball     | build  | 943705


The Hydra build daemon.

gmake[5]: Nothing to be done for `test-extensions'.
gmake[5]: Leaving directory 
gmake  check-TESTS
gmake[5]: Entering directory 
PASS: test-system-cmds
PASS: test-bad-identifiers
PASS: test-require-extension
PASS: test-num2integral
PASS: test-round
PASS: test-asmobs
PASS: test-ffi
PASS: test-list
PASS: test-unwind
PASS: test-conversion
PASS: test-loose-ends
/bin/sh: line 5: 33556 Segmentation fault: 11  (core dumped) builddir="." 
GUILE_AUTO_COMPILE=0 "../../meta/uninstalled-env" ${dir}$tst
FAIL: test-fast-slot-ref
 line 28: 33602 Segmentation fault: 11  (core dumped) guile -q --use-srfi=1,10 
> /dev/null  <<EOF
(if (and (defined? 'partition)
         (defined? 'define-reader-ctor))
    (exit 0)   ;; good
    (exit 1))  ;; bad

guile --use-srfi=1,10 fails to run
FAIL: test-use-srfi
PASS: test-scm-c-read
PASS: test-scm-take-locale-symbol
PASS: test-scm-take-u8vector
PASS: test-extensions
PASS: test-with-guile-module
PASS: test-scm-with-guile
2 of 19 tests failed
Please report to address@hidden
gmake[5]: *** [check-TESTS] Error 1
gmake[5]: Leaving directory 
gmake[4]: *** [check-am] Error 2
gmake[4]: Leaving directory 
gmake[3]: *** [check] Error 2
gmake[3]: Leaving directory 
gmake[2]: *** [check-recursive] Error 1
gmake[2]: Leaving directory 
gmake[1]: *** [check-recursive] Error 1
gmake[1]: Leaving directory 
gmake: *** [check] Error 2
build time elapsed:  0m0.000s 0m0.043s 10m52.392s 0m31.760s
Copying build directory to 
build failed with exit code 2 (ignored)

reply via email to

[Prev in Thread] Current Thread [Next in Thread]