[Top][All Lists]

[Date Prev][Date Next][Thread Prev][Thread Next][Date Index][Thread Index]

[Guile-commits] Hydra job gnu:guile-master:build build 956873: Unknown f

From: Hydra Build Daemon
Subject: [Guile-commits] Hydra job gnu:guile-master:build build 956873: Unknown failure
Date: Wed, 9 Mar 2011 02:28:39 +0100


This is to let you know that Hydra build 956873 of job gnu:guile-master:build 
has changed from 'Success' to 'Unknown failure'.

Complete build information can be found on this page:

The last 50 lines of the build log are shown at the bottom of this email.

A summary of the build information follows:

Build ID:              | 956873
Nix name:              | guile-
Short description:     | Native Nix build on i686-cygwin
Maintainer(s):         | address@hidden
System:                | i686-cygwin
Derivation store path: | 
Output store path:     | 
Time added:            | 2011-03-09 02:28:39
Build started:         | 2011-03-09 01:41:05
Build finished:        | 2011-03-09 02:28:39
Duration:              | 2854s

The build inputs were:

Name        | Type   | Value
hydraConfig | svn    |
nixpkgs     | svn    |
system      | string | i686-cygwin
tarball     | build  | 956782


The Hydra build daemon.

   ?: 0 [dynamic-func "qsort" #<dynamic-object #f>]

ERROR: In procedure dynamic-func:
ERROR: In procedure dynamic-pointer: No error
Running 00-initial-env.test
Running alist.test
Running and-let-star.test
Running arbiters.test
Running arrays.test
Running asm-to-bytecode.test
Running bit-operations.test
Running bitvectors.test
Running brainfuck.test
Running bytevectors.test
Running c-api.test
Running chars.test
Running common-list.test
Running continuations.test
Running control.test
Running coverage.test
ERROR: coverage.test: procedure-execution-count: called from C - arguments: 
((misc-error "dynamic-pointer" "No error" () #f))
Running curried-definitions.test
Running ecmascript.test
Running elisp-compiler.test
Running elisp-reader.test
Running elisp.test
Running eval.test
UNRESOLVED: eval.test: stacks: stack involving a subr
UNRESOLVED: eval.test: stacks: stack involving a gsubr
UNRESOLVED: eval.test: stacks: arguments of a gsubr stack frame
Running exceptions.test
Running filesys.test
Running fluids.test
Running foreign.test
ERROR: foreign.test: make-pointer: equal? modulo finalizer - arguments: 
((misc-error "dynamic-pointer" "No error" () #f))
FAIL: check-guile
1 of 1 test failed
Please report to address@hidden
make[3]: *** [check-TESTS] Error 1
make[3]: Leaving directory 
make[2]: *** [check-am] Error 2
make[2]: Leaving directory 
make[1]: *** [check-recursive] Error 1
make[1]: Leaving directory 
make: *** [check] Error 2
build time elapsed:  0m0.046s 0m0.062s 45m37.884s 8m8.157s
Copying build directory to 
build failed with exit code 2 (ignored)

reply via email to

[Prev in Thread] Current Thread [Next in Thread]