[Top][All Lists]

[Date Prev][Date Next][Thread Prev][Thread Next][Date Index][Thread Index]

[Guile-commits] Hydra job gnu:guile-2-0:tarball build 993348: Unknown fa

From: Hydra Build Daemon
Subject: [Guile-commits] Hydra job gnu:guile-2-0:tarball build 993348: Unknown failure
Date: Thu, 24 Mar 2011 20:24:41 +0100


This is to let you know that Hydra build 993348 of job gnu:guile-2-0:tarball 
has changed from 'Success' to 'Unknown failure'.

Complete build information can be found on this page:

The last 50 lines of the build log are shown at the bottom of this email.

A summary of the build information follows:

Build ID:              | 993348
Nix name:              | 
Short description:     | Build of a source distribution from a checkout
Maintainer(s):         | address@hidden
System:                | x86_64-linux
Derivation store path: | 
Output store path:     | 
Time added:            | 2011-03-24 20:24:41
Build started:         | 2011-03-24 20:21:48
Build finished:        | 2011-03-24 20:24:41
Duration:              | 173s

The build inputs were:

Name        | Type | Value
hydraConfig | svn  |
nixpkgs     | svn  |
guileSrc    | git  | 


The Hydra build daemon.

  SNARF  strorder.doc
building strports.doc
  SNARF  strports.doc
building struct.doc
  SNARF  struct.doc
building symbols.doc
  SNARF  symbols.doc
building threads.doc
  SNARF  threads.doc
building throw.doc
  SNARF  throw.doc
building trees.doc
  SNARF  trees.doc
building uniform.doc
  SNARF  uniform.doc
building values.doc
  SNARF  values.doc
building variable.doc
  SNARF  variable.doc
building vectors.doc
  SNARF  vectors.doc
building version.doc
  SNARF  version.doc
building vports.doc
  SNARF  vports.doc
building weaks.doc
  SNARF  weaks.doc
building filesys.doc
  SNARF  filesys.doc
building posix.doc
  SNARF  posix.doc
building net_db.doc
  SNARF  net_db.doc
building socket.doc
  SNARF  socket.doc
building regex-posix.doc
  SNARF  regex-posix.doc
building guile-procedures.texi
  GEN    guile-procedures.texi
guile: uncaught throw to wrong-type-arg: (#f Wrong type (expecting ~A): ~S 
(exact integer (#t #<catch-closure 3025520> #<catch-closure 30254a0>)) ((#t 
#<catch-closure 3025520> #<catch-closure 30254a0>)))
make[3]: *** [guile-procedures.texi] Error 1
make[3]: Leaving directory 
make[2]: *** [all] Error 2
make[2]: Leaving directory 
make[1]: *** [all-recursive] Error 1
make[1]: Leaving directory 
make: *** [all] Error 2
build time elapsed:  0m0.024s 0m0.014s 1m45.514s 0m26.253s
Copying build directory to 
build failed with exit code 2 (ignored)

reply via email to

[Prev in Thread] Current Thread [Next in Thread]