[Top][All Lists]

[Date Prev][Date Next][Thread Prev][Thread Next][Date Index][Thread Index]

[Guile-commits] Hydra job gnu:guile-2-0:build_disable_deprecated_disable

From: Hydra Build Daemon
Subject: [Guile-commits] Hydra job gnu:guile-2-0:build_disable_deprecated_disable_discouraged build 1040587: Unknown failure
Date: Mon, 11 Apr 2011 14:11:37 +0200


This is to let you know that Hydra build 1040587 of job 
gnu:guile-2-0:build_disable_deprecated_disable_discouraged has changed from 
'Success' to 'Unknown failure'.

Complete build information can be found on this page:

The last 50 lines of the build log are shown at the bottom of this email.

A summary of the build information follows:

Build ID:              | 1040587
Nix name:              | 
Short description:     | Native Nix build on x86_64-linux
Maintainer(s):         | address@hidden
System:                | x86_64-linux
Derivation store path: | 
Output store path:     | 
Time added:            | 2011-04-11 14:11:37
Build started:         | 2011-04-11 14:00:22
Build finished:        | 2011-04-11 14:11:37
Duration:              | 675s

The build inputs were:

Name        | Type  | Value
hydraConfig | svn   |
nixpkgs     | svn   |
tarball     | build | 1040578


The Hydra build daemon.

Running procprop.test
Running procs.test
Running q.test
Running r4rs.test
Running r5rs_pitfall.test
Running r6rs-arithmetic-bitwise.test
Running r6rs-arithmetic-fixnums.test
UNRESOLVED: r6rs-arithmetic-fixnums.test: fx+/carry: simple
UNRESOLVED: r6rs-arithmetic-fixnums.test: fx-/carry: simple
UNRESOLVED: r6rs-arithmetic-fixnums.test: fx*/carry: simple
Running r6rs-arithmetic-flonums.test
Running r6rs-base.test
Running r6rs-conditions.test
Running r6rs-control.test
Running r6rs-enums.test
Running r6rs-eval.test
Running r6rs-exceptions.test
Running r6rs-files.test
Running r6rs-hasERROR: In procedure map:
ERROR: Syntax error:
test-suite/tests/reader.test:433:2: source expression failed to match any 
pattern in form (begin)
Running r6rs-lists.test
Running r6rs-ports.test
UNRESOLVED: r6rs-ports.test: 7.2.11 Binary Output: put-bytevector [2 args]
UNRESOLVED: r6rs-ports.test: 7.2.11 Binary Output: put-bytevector [3 args]
UNRESOLVED: r6rs-ports.test: 7.2.11 Binary Output: put-bytevector [4 args]
Running r6rs-records-inspection.test
Running r6rs-records-procedural.test
Running r6rs-records-syntactic.test
Running r6rs-unicode.test
UNRESOLVED: r6rs-unicode.test: string-foldcase: case folding expands string
Running ramap.test
Running rdelim.test
Running reader.test
FAIL: check-guile
1 of 1 test failed
Please report to address@hidden
make[3]: *** [check-TESTS] Error 1
make[3]: Leaving directory 
make[2]: *** [check-am] Error 2
make[2]: Leaving directory 
make[1]: *** [check-recursive] Error 1
make[1]: Leaving directory 
make: *** [check] Error 2
build time elapsed:  0m0.016s 0m0.013s 9m58.173s 0m31.611s
Copying build directory to 
build failed with exit code 2 (ignored)

reply via email to

[Prev in Thread] Current Thread [Next in Thread]