[Top][All Lists]

[Date Prev][Date Next][Thread Prev][Thread Next][Date Index][Thread Index]

[Guile-commits] Hydra job gnu:guile-2-0:coverage build 1045170: Failed

From: Hydra Build Daemon
Subject: [Guile-commits] Hydra job gnu:guile-2-0:coverage build 1045170: Failed
Date: Fri, 15 Apr 2011 07:32:31 +0200


This is to let you know that Hydra build 1045170 of job gnu:guile-2-0:coverage 
has changed from 'Failed' to 'Failed'.

Complete build information can be found on this page:

The last 50 lines of the build log are shown at the bottom of this email.

A summary of the build information follows:

Build ID:              | 1045170
Nix name:              | guile-coverage-
Short description:     | Coverage analysis
Maintainer(s):         | address@hidden
System:                | x86_64-linux
Derivation store path: | 
Output store path:     | 
Time added:            | 2011-04-15 07:32:31
Build started:         | 2011-04-15 07:11:51
Build finished:        | 2011-04-15 07:32:31
Duration:              | 1240s

The build inputs were:

Name        | Type  | Value
hydraConfig | svn   |
nixpkgs     | svn   |
tarball     | build | 1044779


The Hydra build daemon.

make  check-TESTS
make[5]: Entering directory 
building check-TESTS
PASS: test-system-cmds
PASS: test-bad-identifiers
PASS: test-require-extension
PASS: test-guile-snarf
PASS: test-num2integral
PASS: test-round
PASS: test-asmobs
PASS: test-ffi
PASS: test-list
PASS: test-unwind
PASS: test-conversion
PASS: test-loose-ends
PASS: test-fast-slot-ref
PASS: test-mb-regexp
 line 28: 26467 Segmentation fault      guile -q --use-srfi=1,10 > /dev/null  
(if (and (defined? 'partition)
         (defined? 'define-reader-ctor))
    (exit 0)   ;; good
    (exit 1))  ;; bad

guile --use-srfi=1,10 fails to run
FAIL: test-use-srfi
PASS: test-scm-c-read
PASS: test-scm-take-locale-symbol
PASS: test-scm-take-u8vector
PASS: test-extensions
PASS: test-with-guile-module
PASS: test-scm-with-guile
1 of 21 tests failed
Please report to address@hidden
make[5]: *** [check-TESTS] Error 1
make[5]: Leaving directory 
make[4]: *** [check-am] Error 2
make[4]: Leaving directory 
make[3]: *** [check] Error 2
make[3]: Leaving directory 
make[2]: *** [check-recursive] Error 1
make[2]: Leaving directory 
make[1]: *** [check-recursive] Error 1
make[1]: Leaving directory 
make: *** [check] Error 2
build time elapsed:  0m0.018s 0m0.013s 18m27.781s 0m53.464s
Copying build directory to 
build failed with exit code 2 (ignored)

reply via email to

[Prev in Thread] Current Thread [Next in Thread]