[Top][All Lists]

[Date Prev][Date Next][Thread Prev][Thread Next][Date Index][Thread Index]

[Guile-commits] Hydra job gnu:guile-2-0:build_disable_deprecated_disable

From: Hydra Build Daemon
Subject: [Guile-commits] Hydra job gnu:guile-2-0:build_disable_deprecated_disable_discouraged build 1080016: Failed
Date: Sun, 8 May 2011 00:25:19 +0200


This is to let you know that Hydra build 1080016 of job 
gnu:guile-2-0:build_disable_deprecated_disable_discouraged has changed from 
'Success' to 'Failed'.

Complete build information can be found on this page:

The last 50 lines of the build log are shown at the bottom of this email.

A summary of the build information follows:

Build ID:              | 1080016
Nix name:              | 
Short description:     | Native Nix build on x86_64-linux
Maintainer(s):         | address@hidden
System:                | x86_64-linux
Derivation store path: | 
Output store path:     | 
Time added:            | 2011-05-08 00:25:19
Build started:         | 2011-05-08 00:14:18
Build finished:        | 2011-05-08 00:25:19
Duration:              | 661s

The build inputs were:

Name        | Type  | Value
hydraConfig | svn   |
nixpkgs     | svn   |
tarball     | build | 1080015


The Hydra build daemon.

UNRESOLVED: syntax.test: letrec: bindings: initial bindings are undefined
UNRESOLVED: syntax.test: letrec*: bindings: initial bindings are undefined
Running texinfo.docbook.test
Running texinfo.serialize.test
Running texinfo.string-utils.test
Running texinfo.test
Running threads.test
ERROR: threads.test: parallel: 1 - arguments: ((misc-error "mutex already 
locked by thread"))
ERROR: threads.test: parallel: 1 2 - arguments: ((misc-error "mutex already 
locked by thread"))
ERROR: threads.test: parallel: 1 2 3 - arguments: ((misc-error "mutex already 
locked by thread"))
ERROR: threads.test: par-map: simple - arguments: ((misc-error "mutex already 
locked by thread"))
ERROR: threads.test: par-for-each: simple - arguments: ((misc-error "mutex 
already locked by thread"))
Running time.test
Running tree-il.test
UNRESOLVED: tree-il.test: warnings: unused-toplevel: used by macro
Running version.test
UNRESOLVED: version.test: version reporting works
Running vlist.test
Running weaks.test
Running web-http.test
Running web-request.test
Running web-response.test
Running web-uri.test

Totals for this test run:
passes:                 34001
failures:               0
unexpected passes:      0
expected failures:      31
unresolved test cases:  562
untested test cases:    1
unsupported test cases: 9
errors:                 15

WARNING: (test-suite sxml-xpath): imported module (sxml xpath) overrides core 
binding `filter'
FAIL: check-guile
1 of 1 test failed
Please report to address@hidden
make[3]: *** [check-TESTS] Error 1
make[3]: Leaving directory 
make[2]: *** [check-am] Error 2
make[2]: Leaving directory 
make[1]: *** [check-recursive] Error 1
make[1]: Leaving directory 
make: *** [check] Error 2
build time elapsed:  0m0.014s 0m0.014s 9m46.441s 0m28.027s
Copying build directory to 
build failed with exit code 2 (ignored)

reply via email to

[Prev in Thread] Current Thread [Next in Thread]