[Top][All Lists]

[Date Prev][Date Next][Thread Prev][Thread Next][Date Index][Thread Index]

[Guile-commits] Hydra job gnu:guile-2-0:build_disable_networking build 1

From: Hydra Build Daemon
Subject: [Guile-commits] Hydra job gnu:guile-2-0:build_disable_networking build 1093190: Failed
Date: Sat, 21 May 2011 18:56:04 +0200


This is to let you know that Hydra build 1093190 of job 
gnu:guile-2-0:build_disable_networking has changed from 'Success' to 'Failed'.

Complete build information can be found on this page:

The last 50 lines of the build log are shown at the bottom of this email.

A summary of the build information follows:

Build ID:              | 1093190
Nix name:              | guile-disable-networking-
Short description:     | Native Nix build on x86_64-linux
Maintainer(s):         | address@hidden
System:                | x86_64-linux
Derivation store path: | 
Output store path:     | 
Time added:            | 2011-05-21 18:56:04
Build started:         | 2011-05-21 18:46:16
Build finished:        | 2011-05-21 18:56:04
Duration:              | 588s

The build inputs were:

Name        | Type  | Value
hydraConfig | svn   |
nixpkgs     | svn   |
tarball     | build | 1093189


The Hydra build daemon.

 374: 4 [eval # ()]
In ice-9/boot-9.scm:
2663: 3 [define-module* (test-1) #:filename ...]
2641: 2 [resolve-imports (((base)) ((test-import-order-a)) 
2575: 1 [resolve-interface (test-import-order-a) #:select ...]
In unknown file:
   ?: 0 [scm-error misc-error #f ...]

ERROR: In procedure scm-error:
ERROR: no code for module (test-import-order-a)
FAIL: test-import-order
PASS: test-num2integral
PASS: test-round
PASS: test-asmobs
PASS: test-ffi
PASS: test-list
PASS: test-unwind
PASS: test-conversion
PASS: test-loose-ends
PASS: test-fast-slot-ref
PASS: test-mb-regexp
PASS: test-use-srfi
PASS: test-scm-c-read
PASS: test-scm-take-locale-symbol
PASS: test-scm-take-u8vector
PASS: test-extensions
PASS: test-with-guile-module
PASS: test-scm-with-guile
PASS: test-scm-spawn-thread
PASS: test-pthread-create
SKIP: test-pthread-create-secondary
1 of 24 tests failed
(1 test was not run)
Please report to address@hidden
make[5]: *** [check-TESTS] Error 1
make[5]: Leaving directory 
make[4]: *** [check-am] Error 2
make[4]: Leaving directory 
make[3]: *** [check] Error 2
make[3]: Leaving directory 
make[2]: *** [check-recursive] Error 1
make[2]: Leaving directory 
make[1]: *** [check-recursive] Error 1
make[1]: Leaving directory 
make: *** [check] Error 2
build time elapsed:  0m0.023s 0m0.010s 8m40.008s 0m47.930s
Copying build directory to 
build failed with exit code 2 (ignored)

reply via email to

[Prev in Thread] Current Thread [Next in Thread]